program: Gaussian 09
title: 000022428
version: EM64L-G09RevD.01
frameworkgroup: C1[X(C10H7N5O2)]
method: RPBEPBE
basis: SDD
operation: Freq
keyword: #p
keyword: freq=noraman
keyword: PBEPBE/SDD
title: #p freq=noraman PBEPBE/SDD
converged: YES YES NO NO
title: Mulliken charges:
elementType: O O N N N N N C C C C C C C C C C H H H H H H H
charge: -0.195930 -0.174787 0.017375 -0.042067 -0.073102 0.032273 0.029581 0.487009 0.283235 -0.487814 0.108451 -0.387070 -0.268445 -0.793905 -0.149944 -0.123195 -0.122202 0.292054 0.251154 0.273737 0.240339 0.250922 0.233934 0.318398
chargesum: 0.00000
title: Mulliken charges with hydrogens summed into heavy atoms:
elementType: O O N N N N N C C C C C C C C C C
charge: -0.195930 -0.174787 0.017375 -0.042067 -0.073102 0.032273 0.029581 0.487009 0.283235 -0.195760 0.108451 -0.135916 0.005292 -0.068711 0.168454 -0.123195 -0.122202
polarizability: 2.44710630e+02 2.83051517e+00 1.55388881e+02 6.37725078e+00 -7.37795113e-01 8.96159857e+01
1716.lowfreq: -8.0277 -2.9323 -1.8415 0.0007 0.0008 0.0009 16.7764 39.0337 41.4414
frequency: 16.7442 39.0259 41.4049 53.4605 63.5277 90.1946 110.3477 138.2598 158.4282 196.2747 224.8755 267.2436 285.4041 321.4970 358.3082 363.5681 373.8790 400.3525 450.0934 490.1549 506.3021 528.1930 564.3090 568.0750 643.2286 660.4781 670.9482 733.0241 740.7179 777.5435 837.1032 892.0975 900.9619 917.5497 931.0609 976.9107 1005.2347 1013.6328 1048.2760 1064.5625 1147.6453 1189.6509 1200.3802 1223.8965 1227.3275 1270.2408 1281.8945 1353.2491 1371.1727 1402.7286 1403.9865 1423.7180 1467.1880 1473.4036 1480.3528 1563.8836 1613.2102 2207.6964 2216.5204 2979.9674 2984.1532 3067.1850 3098.8314 3143.4447 3167.3397 3170.2511
redmass: 10.4639 3.2774 1.2658 9.1106 9.7562 6.3612 10.1219 7.3904 6.0895 5.7828 5.8049 9.4178 7.2528 5.4787 6.8872 7.4772 5.1641 4.7747 6.1669 5.4206 8.2513 7.7170 10.5410 4.2658 6.8771 7.2034 5.3266 7.9265 5.6644 6.7495 1.4171 7.5867 4.2713 1.4579 4.8956 1.3741 1.4672 3.4929 1.6337 2.9678 1.4074 2.5004 6.2728 1.5399 2.3241 1.6336 1.4034 6.6146 5.3103 1.5571 3.7709 4.8748 1.1377 1.0737 2.6667 6.4387 6.9347 12.5934 12.5991 1.0813 1.0395 1.0943 1.1003 1.0893 1.0940 1.0945
irintensity: 2.4323 1.0015 0.5965 1.4576 1.9412 0.8446 3.1556 2.9135 1.9006 5.1679 1.4431 5.2727 0.5562 1.1314 3.8989 2.0185 1.0329 1.4632 0.4783 10.9487 1.7622 12.0815 3.5277 7.5367 10.8020 2.8513 0.8829 9.6506 7.5497 1.3141 42.3909 3.9410 6.0621 12.5360 14.6326 3.4279 2.7995 16.6449 15.9414 6.9262 8.6712 26.9033 122.9228 2.1666 46.5483 10.3633 2.7371 132.1511 48.3903 45.2689 8.8818 3.7872 15.5909 16.7313 21.1900 13.4277 43.3147 2.5184 0.5010 6.1701 12.3192 14.5636 11.3234 7.3222 0.5814 3.6189
temp: 298.150 k
press: 1.00000 atm
elementType: 8 8 7 7 7 7 7 6 6 6 6 6 6 6 6 6 6 1 1 1 1 1 1 1
symmnumber: 1
zpe: 416016.8 jmol-1
zpe.correction: 0.158452 hartree
zpe.thermalcorrener: 0.174598 hartree
zpe.thermalcorrenthalpy: 0.175543 hartree
zpe.thermalcorrgfe: 0.111746 hartree
zpe.sumelectzpe: -808.085727 hartree
zpe.sumelectthermal: -808.069581 hartree
zpe.sumelectthermalent: -808.068637 hartree
zpe.sumelectthermalfe: -808.132433 hartree
dipole: -6.7242 -3.6452 -0.2466
dipole: 7.6526
quadrupole: -99.9782 -105.9019 -105.6466
quadrupole: 16.1561 -8.5653 -4.8425
quadrupole: 3.8640 -2.0597 -1.8044 16.1561 -8.5653 -4.8425
hfenergy: -808.244179 hartree
pointgroup: C01 [X(C10H7N5O2)]
dipole: -2.7288083 1.2656698 -0.1281251 debye
dipolederiv: -0.5911265 -0.1949271 0.1811744 -0.2295908 -0.6762374 0.1998361 0.2459532 0.2442245 -0.3474735 -0.6049986 0.0338505 0.1614621 0.1883291 -0.525511 0.0590893 0.1151168 0.0976547 -0.2613121 0.9324656 -0.0345208 -0.3541007 0.0408137 1.3485074 -0.3643538 -0.3878848 -0.4699141 0.4311962 0.4317642 -0.0338662 0.0195338 0.3556522 0.0772172 0.0033255 -0.1752226 -0.1140246 -0.0620449 0.0368587 0.0503879 0.0589176 -0.5127338 -0.1863826 -0.127415 0.5549936 0.0479641 -0.1163696 -0.1506816 -0.0004643 -0.0492354 0.0041355 -0.1701303 0.0291338 0.014991 0.0203011 -0.1159549 -0.1441839 0.0345502 0.0040677 -0.0735343 -0.1242189 0.005492 -0.0266315 0.0356984 -0.1768551 0.6245255 -0.1957012 0.0757416 -0.3464222 -0.120563 0.0106028 0.0423236 0.0739241 -0.0321936 0.3140389 0.1623908 0.0245346 0.0493789 -0.478857 0.151927 -0.1203978 0.1850391 0.0064812 -0.3496376 -0.1192825 0.0175143 0.4127076 0.039296 -0.0215082 -0.1474253 -0.0337407 -0.1097332 -0.2691475 0.2135364 -0.0182377 -0.053069 0.104081 0.0008782 -0.0930454 -0.0215579 0.052165 -0.2071294 0.0428075 0.0015702 -0.1076815 0.1747716 -0.0853616 0.0636425 -0.0839519 -0.0916332 -0.0513693 0.0852623 -0.0343595 0.0397416 -0.0250468 0.0054503 0.2024305 0.0064493 -0.0761059 -0.2895592 0.0701246 -0.0236312 0.0730674 0.0446232 -0.0065377 0.1404967 -0.0405959 0.0642387 0.351465 -0.0220381 -0.05657 -0.0704817 0.3892497 0.0326143 -0.0672554 0.0174415 0.4154401 -0.1194477 -0.025556 -0.0179436 -0.0341294 -0.0596347 -0.0075318 -0.1558485 -0.0479782 -0.056413 -0.2232795 -0.002932 0.0245823 0.2364048 0.0062379 0.0182149 0.0214861 0.0030078 -0.0523903 0.0696002 -0.0285521 -0.0067652 -0.0459474 0.0790845 0.016431 0.0385351 -0.0088622 0.1624856 0.0655873 0.0562256 -0.030034 0.0528342 -0.0393945 0.0570227 -0.0577604 0.0385983 0.1308137 0.0498704 -0.0672577 -0.007959 -0.0525983 0.0690154 0.0156065 -0.0497843 0.0281661 0.1387916 0.0216665 -0.0274878 -0.0430382 -0.0868969 -0.0358441 -0.0732134 -0.0919365 -0.0282779 0.0829559 -0.0029258 0.0458143 0.0388473 0.0572298 0.1025494 -0.0293677 0.0554055 -0.0444741 -0.0513794 0.05747 -0.0227399 0.0137769 0.0418602 -0.0335088 0.1176947 -0.0726302 0.1082191 0.0303961 0.0481743 -0.0196244 0.0201518 0.0609302 0.0406955 -0.0080296 -0.049552 -0.0133106 0.0348947 unknown
polarizability: 244.9767849|2.4729055|154.4383872|-1.3281261|-7.8652794|90.3003253 unknown
InChI: InChI=1S/C10H7N5O2/c1-7-2-3-9(10(4-7)15(16)17)14-13-8(5-11)6-12/h2-4,8H,1H3
charge 0 multiplicity 1
24 atoms
O  -2.25078 -2.889916 1.055647
O  -0.148731 -2.581032 0.211411
N  -1.33938 -2.165015 0.496666
N  0.688153 -0.121867 0.359824
N  1.614832 0.461309 -0.326697
N  4.639938 -0.683094 -1.613982
N  3.827453 2.35848 1.541185
C  -3.409921 0.860257 -0.44564
C  -1.682462 -0.768916 0.151206
C  -3.03683 -0.445507 -0.040993
C  -0.651438 0.193888 -0.032734
C  -2.379761 1.817947 -0.653025
C  -1.025341 1.498342 -0.444185
C  -4.867793 1.224116 -0.636243
C  2.987195 0.143591 0.310029
C  3.909612 -0.300807 -0.754522
C  3.474516 1.366864 0.982641
H  -3.786296 -1.227396 0.114252
H  -2.648149 2.830001 -0.975786
H  -0.239574 2.249518 -0.572573
H  -5.44534 0.381735 -1.054262
H  -5.334463 1.490221 0.331869
H  -4.984996 2.090949 -1.308172
H  2.863058 -0.663069 1.062983
