program: Gaussian 09
title: 000286561
version: EM64L-G09RevD.01
frameworkgroup: C1[X(C20H20Cl2N8O5)]
method: RPBEPBE
basis: SDD
operation: Freq
keyword: #p
keyword: freq=noraman
keyword: PBEPBE/SDD
title: #p freq=noraman PBEPBE/SDD
converged: YES YES NO NO
title: Mulliken charges:
elementType: Cl Cl O O O O O N N N N N N N N C C C C C C C C C C C C C C C C C C C C H H H H H H H H H H H H H H H H H H H H
charge: -0.026806 -0.056189 -0.405413 -0.282801 -0.230945 -0.453541 -0.348749 -0.202651 -0.402123 -0.035924 0.042982 -0.002942 -0.395109 -0.618354 -0.592541 -0.133958 -0.404869 0.596407 -0.462007 -0.535112 0.394593 0.154293 -0.368240 -0.266755 -0.340566 -0.361639 0.129076 0.228824 -0.646228 0.247915 -0.404706 -0.066413 -0.043962 0.325263 0.100097 0.300483 0.266499 0.240170 0.340789 0.234867 0.234419 0.227882 0.229295 0.272642 0.305567 0.227936 0.255795 0.239134 0.247638 0.386221 0.398972 0.369085 0.359627 0.397017 0.335052
chargesum: 0.00000
title: Mulliken charges with hydrogens summed into heavy atoms:
elementType: Cl Cl O O O O O N N N N N N N N C C C C C C C C C C C C C C C C C C C C
charge: -0.026806 -0.056189 -0.019192 -0.282801 -0.230945 -0.054569 -0.348749 -0.202651 -0.061333 -0.035924 0.042982 -0.002942 -0.395109 0.110358 0.139528 0.166525 0.101800 0.596407 -0.004831 -0.065826 0.394593 0.154293 -0.368240 0.005886 -0.340566 -0.056072 0.129076 0.228824 0.076638 0.247915 -0.157067 -0.066413 -0.043962 0.325263 0.100097
polarizability: 4.44929903e+02 -2.47607853e+01 2.56801919e+02 -3.63227924e+00 2.90647686e+01 2.70902131e+02
1716.lowfreq: -11.4212 -8.1784 -3.5412 -0.0019 -0.0016 -0.0011 4.6109 20.6556 31.2005
frequency: -8.3573 20.3122 31.0563 39.3561 44.7874 49.5734 55.2458 63.1187 74.0280 81.9317 85.5328 98.1409 99.5707 119.6282 133.5776 139.3819 159.9709 166.9443 176.6721 182.4814 197.4938 206.2135 215.0428 225.9927 233.5753 253.7278 261.7231 267.4576 281.2931 286.3674 304.4483 318.2989 324.9516 329.0782 349.2052 378.2913 389.9856 418.1311 430.7958 435.8916 442.2092 455.9703 486.0356 494.9555 527.9852 542.0120 555.5105 558.8365 571.3081 580.1562 587.5989 592.9887 602.5163 604.9255 613.6123 617.2674 621.2417 635.3578 642.8182 661.9406 672.2625 695.8316 700.7084 701.4373 708.5312 720.0069 740.2110 742.6288 758.8567 780.8482 807.1190 812.6913 836.8917 849.2120 869.4288 901.0310 904.1594 914.6986 919.2232 924.9884 931.6113 939.7754 959.4006 983.0866 994.1948 1019.1942 1027.0665 1040.2895 1064.9446 1066.3110 1103.3831 1111.2112 1112.1827 1119.1974 1149.3925 1156.0075 1162.0891 1165.5698 1214.8306 1224.3568 1241.3515 1248.9269 1253.9968 1262.3454 1272.9513 1286.0137 1297.1117 1300.0328 1309.8086 1316.9295 1343.3040 1349.3538 1351.5752 1362.0162 1370.9536 1374.1461 1385.0924 1396.1602 1428.0769 1439.3427 1448.2221 1452.2995 1460.4422 1462.5224 1471.3820 1474.2646 1489.8344 1495.7934 1502.8135 1508.2286 1516.6141 1552.1840 1571.0037 1581.6016 1587.4393 1598.8463 1635.6668 1655.8645 1665.2973 1752.1107 2956.0377 2977.9676 3013.6919 3018.1673 3026.1339 3029.1039 3067.8028 3080.9986 3083.8623 3092.8332 3119.4026 3120.1995 3163.8249 3183.2117 3483.3159 3509.1926 3518.3375 3613.8449 3634.4404
redmass: 6.8600 10.1237 7.3119 9.4203 10.6051 8.9453 10.2353 3.9215 6.7883 4.8840 9.3075 5.7999 7.6355 5.7598 8.2333 6.1017 2.8438 5.6078 4.0409 3.9857 5.9973 5.9710 3.1060 4.6788 6.7300 5.0412 4.1926 5.9635 3.8958 5.2314 18.3809 4.1890 2.9837 3.2107 4.1244 5.8235 3.5149 4.6323 5.0417 4.3065 4.5180 3.5245 7.2458 3.4330 6.4245 5.2472 5.6860 3.2143 2.9708 2.7470 2.8517 3.1014 3.6550 1.6619 3.1117 1.5804 1.2150 3.2147 5.9802 2.1255 2.7498 4.2005 4.3474 4.9047 4.3235 5.0848 5.7822 6.0512 5.2900 2.7835 3.3989 8.0807 5.8412 1.5861 2.1635 2.0221 2.5894 2.8982 1.6406 1.4538 1.7973 2.4281 3.8450 2.9602 3.3429 2.6169 3.4671 3.1574 3.2089 3.8345 1.7573 2.7362 1.5623 2.1443 2.1879 1.5952 1.3434 2.7256 2.0816 1.3168 2.3185 1.3597 1.4490 2.1104 4.0239 1.4508 3.2029 2.9892 1.6050 2.2642 2.1252 2.7276 1.6744 1.3146 2.4737 1.6114 5.2579 3.7818 3.5017 1.3425 4.7252 1.1359 1.0917 1.2135 1.1337 1.1565 2.8914 1.8867 3.5523 3.1459 5.3808 3.8415 7.1965 2.1497 4.6613 6.5922 2.1543 8.5257 1.4403 1.2323 1.0380 1.0661 1.0637 1.0658 1.0734 1.1016 1.0967 1.1027 1.1026 1.0766 1.0933 1.0948 1.0916 1.0918 1.0463 1.0780 1.0643 1.0834 1.1046
irintensity: 0.2766 1.5068 0.7221 0.5167 2.4231 2.7266 2.3662 3.2878 2.8546 0.8803 1.8080 1.7305 1.4626 3.1975 4.1353 3.4434 2.9716 6.9661 5.9698 2.2736 2.5927 5.5598 0.5965 2.7443 0.5314 24.6206 9.8495 10.6170 8.2310 7.7415 0.0422 0.7673 16.5956 8.0285 23.6355 2.7245 7.5949 30.6501 37.4703 48.1637 81.9895 7.4103 13.6621 41.8987 14.8534 9.7932 20.1121 29.9672 6.8433 97.7185 53.5614 98.0179 1.8842 81.0173 31.7757 194.5068 3.4641 11.5687 39.7165 131.4568 131.9682 41.0066 29.9747 52.5469 12.8498 14.5406 47.3629 2.9509 97.2730 1103.3670 157.0131 9.3020 14.7351 52.1598 852.8326 132.8698 11.6761 2.5261 638.9248 53.8411 20.1981 23.3056 164.9064 15.8429 39.9299 80.0604 123.0031 145.4304 34.1684 14.1645 19.9470 11.3913 12.0317 52.7918 12.1106 1.7035 3.1532 9.1531 20.8788 9.0655 126.4434 35.5712 4.8858 13.8406 18.0864 16.0932 61.0386 5.9252 5.8426 12.5296 205.8632 3.7128 53.8805 74.8848 71.8111 16.9163 39.6743 15.1056 126.0614 41.5735 25.2430 34.3017 27.9368 29.4656 26.7010 27.3070 36.5836 240.2391 30.3701 31.9024 66.2733 192.9963 229.5040 459.5233 290.0310 294.7148 423.2144 185.3291 287.2046 220.5044 106.5243 80.3532 18.4736 5.2646 35.8825 27.4520 11.7067 7.2612 60.6537 1096.2360 6.5402 16.0134 7.9055 1.5051 129.0965 42.1169 36.1040 108.3380 88.5761
temp: 298.150 k
press: 1.00000 atm
elementType: 17 17 8 8 8 8 8 7 7 7 7 7 7 7 7 6 6 6 6 6 6 6 6 6 6 6 6 6 6 6 6 6 6 6 6 1 1 1 1 1 1 1 1 1 1 1 1 1 1 1 1 1 1 1 1
symmnumber: 1
zpe: 1046694.6 jmol-1
zpe.correction: 0.398665 hartree
zpe.thermalcorrener: 0.430253 hartree
zpe.thermalcorrenthalpy: 0.431197 hartree
zpe.thermalcorrgfe: 0.335518 hartree
zpe.sumelectzpe: -2505.916071 hartree
zpe.sumelectthermal: -2505.884483 hartree
zpe.sumelectthermalent: -2505.883539 hartree
zpe.sumelectthermalfe: -2505.979218 hartree
dipole: 2.0640 -2.4146 -4.9047
dipole: 5.8435
quadrupole: -177.4864 -231.6093 -221.9163
quadrupole: -12.4516 -6.9176 3.1833
quadrupole: 32.8510 -21.2720 -11.5790 -12.4516 -6.9176 3.1833
hfenergy: -2506.314736 hartree
pointgroup: C01 [X(C20H20Cl2N8O5)]
dipole: -0.4153504 -1.0236703 2.016178 debye
polarizability: 384.6737323|93.3388238|310.7314668|8.0939958|-25.5039794|277.2287537 unknown
InChI: InChI=1S/C20H20Cl2N8O5/c1-29-7-8-6-25-17-15(26-8)16(23)30(20(24)28-17)36-35-14(31)3-2-12(19(33)34)27-18(32)9-4-11(22)13(29)5-10(9)21/h4-6,12,27,33H,2-3,7,23-24H2,1H3
charge 0 multiplicity 1
55 atoms
Cl -2.037558 -3.319071 -2.537374
Cl 1.561114 -1.315677 2.418598
O  6.4004 0.951715 0.388117
O  2.813186 -1.367127 -2.008244
O  4.69345 0.595385 1.922639
O  1.456412 3.041292 0.572013
O  1.608714 3.793734 -1.598903
N  -2.834172 -3.325861 0.544455
N  2.913527 -0.039479 -0.11199
N  -2.71415 -0.278815 1.490339
N  -4.411971 0.482625 -0.696241
N  -2.900364 2.235225 -1.246506
N  -0.955068 2.623725 0.185419
N  -0.580748 1.422958 2.167917
N  -1.17266 3.704938 -1.873661
C  4.204964 0.532509 -0.510269
C  4.142035 1.89071 -1.283952
C  -1.537093 -2.885583 0.216856
C  3.667227 3.131145 -0.466279
C  -3.648175 -2.543228 1.521789
C  1.060626 -1.689151 -0.375167
C  2.331314 -1.034393 -0.875453
C  -1.015801 -2.810291 -1.112802
C  -0.666568 -2.410715 1.243325
C  0.573194 -1.828109 0.948566
C  0.233369 -2.244705 -1.392438
C  5.07718 0.675016 0.734892
C  -3.696137 -1.102119 1.048564
C  -3.4149 -4.580441 0.029894
C  2.160191 3.349304 -0.5309
C  -4.579644 -0.659086 -0.000541
C  -2.506977 0.869833 0.774075
C  -3.275635 1.232488 -0.391955
C  -1.337428 1.670555 1.070797
C  -1.711103 2.842186 -0.974428
H  4.678452 -0.192979 -1.199068
H  3.498019 1.749734 -2.169625
H  5.166294 2.081852 -1.651145
H  2.556775 0.1987 0.818033
H  -4.655472 -2.994141 1.533743
H  -3.242385 -2.589784 2.551805
H  4.136151 4.027255 -0.909782
H  3.983977 3.065427 0.589084
H  -0.984176 -2.503213 2.283517
H  0.600907 -2.174145 -2.420879
H  -3.745824 -5.21374 0.877537
H  -2.655996 -5.141411 -0.534962
H  -4.277028 -4.403811 -0.641516
H  -5.452602 -1.265794 -0.271363
H  6.946087 1.063087 1.213268
H  0.2591 3.003233 0.340898
H  0.323971 1.884874 2.290297
H  -0.840534 0.628114 2.753271
H  -0.1543 3.943371 -1.812994
H  -1.698165 3.85368 -2.734271
