program: Gaussian 09
title: 000282325
version: EM64L-G09RevD.01
frameworkgroup: C1[X(C17H16N2O2)]
method: RPBEPBE
basis: SDD
operation: Freq
keyword: #p
keyword: freq=noraman
keyword: PBEPBE/SDD
title: #p freq=noraman PBEPBE/SDD
converged: YES YES NO NO
title: Mulliken charges:
elementType: O O N N C C C C C C C C C C C C C C C C C H H H H H H H H H H H H H H H H
charge: -0.418986 -0.226884 -0.229541 0.037190 0.123235 -0.581035 0.332869 0.391042 -0.313082 -0.445072 -0.367103 -0.388635 -0.404924 -0.384247 -0.248808 -0.252620 -0.243998 -0.249966 0.215510 -0.247508 -0.242949 0.246348 0.263980 0.253797 0.269843 0.273120 0.250730 0.268852 0.314373 0.251043 0.225708 0.229839 0.230534 0.227546 0.228173 0.231307 0.380318
chargesum: 0.00000
title: Mulliken charges with hydrogens summed into heavy atoms:
elementType: O O N N C C C C C C C C C C C C C C C C C
charge: -0.038668 -0.226884 -0.229541 0.037190 0.123235 -0.070706 0.332869 0.391042 -0.059284 0.097891 -0.116373 -0.119782 -0.090551 -0.133204 -0.023101 -0.022781 -0.013465 -0.022420 0.215510 -0.019334 -0.011642
polarizability: 2.26111857e+02 5.57117918e+00 1.83255280e+02 3.77705191e+00 1.24523904e+01 1.71527713e+02
1716.lowfreq: -10.1969 -8.0228 -0.8351 -0.0004 0.0003 0.0009 25.1731 37.4291 52.4872
frequency: 24.9849 37.3803 52.4561 55.5728 59.6329 79.9143 90.6763 108.8833 152.3074 216.3530 220.6392 252.8439 286.2916 294.8735 320.1952 333.8839 374.0723 403.5244 412.0095 432.1680 484.6655 493.1036 529.2012 548.7581 586.7361 613.9813 616.2380 618.5747 642.5964 666.8169 706.6596 715.8800 728.9586 737.9744 764.6469 773.6705 815.9428 819.9073 843.3708 857.7240 871.1386 907.3233 922.0833 940.1704 943.4990 957.6265 982.6526 985.5623 988.9196 990.1021 991.6972 999.9723 1006.8090 1019.2694 1030.6678 1033.3690 1042.8420 1064.5437 1087.1809 1093.3878 1130.0409 1172.9850 1174.8192 1189.1665 1194.5351 1199.2015 1233.2965 1246.6792 1248.3404 1263.8099 1278.2081 1287.2006 1320.6229 1327.0012 1365.6482 1373.4090 1378.1345 1431.9314 1432.7193 1437.0090 1463.8562 1480.8438 1482.6528 1547.2403 1584.9363 1589.7158 1607.9649 1611.0815 1678.4578 2993.7602 3001.7885 3056.7663 3060.4867 3119.0121 3123.7780 3127.4349 3130.1996 3138.2006 3142.7024 3146.8101 3150.3096 3161.5070 3165.1001 3199.1232 3519.3313
redmass: 5.1762 4.4603 5.5433 6.5214 4.7446 4.8091 4.2949 4.4357 5.3759 4.7383 4.1299 4.0161 5.9827 3.8828 3.3543 4.9550 3.7401 2.8508 2.9460 3.9430 3.0784 2.6498 3.3251 3.7867 4.0443 6.1817 6.3441 6.0341 1.4532 6.1543 1.7497 1.9923 1.9314 1.7311 2.0375 1.9178 2.8617 5.7660 4.8533 1.2535 1.2527 2.5157 2.4692 1.8301 1.7309 2.2218 1.8185 2.2868 4.3232 2.3691 1.8219 1.3959 2.8632 1.5488 2.2981 2.1006 2.6918 2.3539 1.6121 1.6815 1.3394 1.0522 1.0545 3.1441 1.1269 1.1324 2.2794 1.4733 1.4005 1.9576 2.1834 2.2840 1.4138 1.3398 1.6329 6.4257 7.9381 1.9367 1.2115 2.1432 1.1552 2.0958 2.1570 6.2784 5.8568 6.1671 5.9272 5.9407 8.6589 1.0620 1.0618 1.1014 1.0971 1.0852 1.0846 1.0877 1.0874 1.0924 1.0919 1.0961 1.0959 1.1015 1.1014 1.0954 1.0640
irintensity: 0.6486 0.4686 0.8294 0.9607 0.8813 1.0198 0.4314 0.9970 3.3401 1.0742 1.0250 1.8718 0.0778 3.6913 5.9491 0.4193 4.4125 0.0669 0.0394 2.1091 14.4621 13.3750 15.9255 50.8494 25.5289 3.8262 0.9424 8.6480 124.0452 7.4326 47.5591 55.1302 23.4381 18.0870 76.8258 38.8128 10.8547 11.0147 7.7537 0.0770 1.0307 11.1367 17.8403 8.7178 1.9010 6.9521 6.0656 5.0611 0.6645 2.4941 2.9016 0.7415 15.7116 28.1546 21.2962 15.2121 204.0507 103.0799 10.6449 5.3477 0.9443 0.0645 0.0490 7.4355 3.5248 1.2058 17.0974 6.0670 20.5118 34.0603 46.6773 29.7821 6.1281 1.8295 23.8329 0.8241 0.9399 19.5758 18.4983 11.7787 14.0965 12.4420 25.3987 41.3118 1.3698 0.3504 7.0499 3.2940 199.3392 33.3618 13.5799 12.8110 5.8197 3.5998 2.1921 10.7557 1.9227 27.2703 14.6047 9.2397 29.2840 41.7786 21.0808 3.6727 30.9412
temp: 298.150 k
press: 1.00000 atm
elementType: 8 8 7 7 6 6 6 6 6 6 6 6 6 6 6 6 6 6 6 6 6 1 1 1 1 1 1 1 1 1 1 1 1 1 1 1 1
symmnumber: 1
zpe: 763221.7 jmol-1
zpe.correction: 0.290696 hartree
zpe.thermalcorrener: 0.308713 hartree
zpe.thermalcorrenthalpy: 0.309657 hartree
zpe.thermalcorrgfe: 0.242896 hartree
zpe.sumelectzpe: -915.831995 hartree
zpe.sumelectthermal: -915.813978 hartree
zpe.sumelectthermalent: -915.813034 hartree
zpe.sumelectthermalfe: -915.879795 hartree
dipole: 1.9799 -1.7400 -1.0286
dipole: 2.8294
quadrupole: -116.4986 -118.7638 -113.9432
quadrupole: 0.7839 5.2004 -4.7820
quadrupole: -0.0967 -2.3619 2.4586 0.7839 5.2004 -4.7820
hfenergy: -916.122691 hartree
pointgroup: C01 [X(C17H16N2O2)]
dipole: -0.2886254 -1.0370789 -0.2834469 debye
polarizability: 196.4964792|-18.7308883|213.660339|14.2753993|-2.1458711|170.7380314 unknown
InChI: InChI=1S/C17H16N2O2/c20-16(21)13-19-17(11-12-18-19,14-7-3-1-4-8-14)15-9-5-2-6-10-15/h1-10,12,20H,11,13H2
charge 0 multiplicity 1
37 atoms
O  3.118976 2.299347 -2.059007
O  1.395725 3.330198 -0.892028
N  1.000063 0.811632 0.520438
N  1.748104 1.070077 1.677982
C  -0.167126 -0.140637 0.782106
C  -0.217604 -0.080858 2.36108
C  -1.482053 0.409083 0.200949
C  0.214717 -1.541082 0.242764
C  1.096942 0.59522 2.720158
C  1.738478 0.859451 -0.730331
C  -2.647416 -0.403232 0.208492
C  -0.198964 -1.974509 -1.045562
C  -1.584536 1.74943 -0.244473
C  1.102604 -2.375365 0.974801
C  -3.886277 0.110133 -0.231166
C  0.241267 -3.207415 -1.575624
C  -2.825497 2.260015 -0.692463
C  1.544238 -3.608153 0.447134
C  2.022908 2.293313 -1.184638
C  -3.979974 1.445783 -0.68955
C  1.112769 -4.033277 -0.830414
H  -0.337241 -1.080494 2.813986
H  -1.075557 0.532832 2.692887
H  1.483849 0.758166 3.727171
H  1.135122 0.380431 -1.522403
H  2.700882 0.315107 -0.686267
H  -2.585309 -1.43977 0.560893
H  -0.883518 -1.351492 -1.631778
H  -0.696606 2.391051 -0.225986
H  1.466839 -2.059716 1.958257
H  -4.776149 -0.529531 -0.215965
H  -0.097836 -3.522278 -2.568997
H  -2.886533 3.29845 -1.037481
H  2.226705 -4.235074 1.032044
H  -4.940667 1.845379 -1.033624
H  1.451875 -4.99168 -1.238946
H  3.2762 3.227567 -2.38284
