program: Gaussian 09
title: 000282286
version: EM64L-G09RevD.01
frameworkgroup: C1[X(C12H6Cl2O3)]
method: RPBEPBE
basis: SDD
operation: Freq
keyword: #p
keyword: freq=noraman
keyword: PBEPBE/SDD
title: #p freq=noraman PBEPBE/SDD
converged: YES YES NO NO
title: Mulliken charges:
elementType: Cl Cl O O O C C C C C C C C C C C C H H H H H H
charge: 0.062194 0.000208 -0.387691 -0.134696 -0.152296 0.302382 0.303431 0.059230 0.182723 -0.189203 -0.165547 -0.355701 -0.361331 -0.217203 -0.228473 0.043710 -0.478815 0.290911 0.291676 0.242922 0.245519 0.282446 0.363606
chargesum: 0.00000
title: Mulliken charges with hydrogens summed into heavy atoms:
elementType: Cl Cl O O O C C C C C C C C C C C C
charge: 0.062194 0.000208 -0.024085 -0.134696 -0.152296 0.302382 0.303431 0.059230 0.182723 -0.189203 -0.165547 -0.064791 -0.069655 0.025718 0.017046 0.326155 -0.478815
polarizability: 2.74154405e+02 2.25637490e+01 1.86836697e+02 -3.70511312e+00 1.73318847e+00 6.82853874e+01
1716.lowfreq: -4.7152 -1.3442 -0.0012 0.0005 0.0019 4.3610 29.1499 39.8287 49.2979
frequency: 29.1266 39.8246 49.2964 98.5383 118.3350 159.2169 178.6735 208.9398 227.2596 277.1446 318.3092 325.5531 363.5660 367.0420 403.1505 410.0175 427.0640 443.5941 457.3227 478.7123 507.6149 547.2066 580.9758 623.3559 658.7363 669.9751 700.2812 731.1524 790.9539 799.6370 844.5541 870.7343 887.5786 927.9684 947.8411 984.2776 993.8017 1013.0913 1042.1697 1088.5413 1156.2804 1175.7110 1191.7940 1215.3290 1258.5698 1284.6624 1299.1963 1388.3221 1398.2764 1438.6554 1483.0713 1537.2179 1556.3216 1577.1499 1592.8355 1612.0604 1633.9063 3088.2017 3142.1324 3155.1189 3169.8055 3187.0817 3448.7478
redmass: 13.7968 9.1098 13.2004 9.5899 4.8977 9.9580 6.5563 14.2896 7.8510 6.6594 18.6024 7.1438 7.1867 12.0514 4.4789 6.8959 3.8210 2.7112 9.1261 1.8438 6.0445 6.0455 5.2465 7.7059 6.3694 5.0296 6.8733 3.7575 1.4558 4.5903 1.9932 3.2736 4.0263 1.8109 5.0814 7.1897 1.4014 1.3688 2.0456 2.5150 3.6997 1.1035 1.5367 2.7377 2.5825 1.7571 1.6416 2.4575 10.2011 2.4537 2.8142 12.5345 8.3391 8.6037 7.3017 8.2759 9.9012 1.0855 1.0866 1.0914 1.0978 1.0961 1.0656
irintensity: 1.3802 0.4899 0.1104 1.5854 1.7873 2.9040 0.1960 0.6556 2.6513 2.3223 0.9029 3.9721 4.9767 6.1059 6.4827 13.8651 31.3879 27.2479 7.3446 54.2824 16.0843 7.4432 26.9038 17.2374 3.1534 34.2578 28.6123 3.2806 58.8416 64.1443 55.8587 7.4311 13.8633 0.3952 34.6666 27.8020 3.7841 0.0468 1.9525 12.5435 42.3223 15.2837 102.3576 29.2714 92.4150 23.9825 58.6251 47.4444 8.1214 20.0104 30.2000 265.4191 77.9268 88.7070 7.7809 15.4483 36.5949 31.4321 3.1135 4.3595 17.6610 6.1674 186.0703
temp: 298.150 k
press: 1.00000 atm
elementType: 17 17 8 8 8 6 6 6 6 6 6 6 6 6 6 6 6 1 1 1 1 1 1
symmnumber: 1
zpe: 386283.6 jmol-1
zpe.correction: 0.147128 hartree
zpe.thermalcorrener: 0.161800 hartree
zpe.thermalcorrenthalpy: 0.162744 hartree
zpe.thermalcorrgfe: 0.103567 hartree
zpe.sumelectzpe: -1605.452430 hartree
zpe.sumelectthermal: -1605.437757 hartree
zpe.sumelectthermalent: -1605.436813 hartree
zpe.sumelectthermalfe: -1605.495990 hartree
dipole: -1.8276 -5.7124 -0.8233
dipole: 6.0538
quadrupole: -95.8110 -123.0885 -111.9493
quadrupole: 9.0887 -1.1051 -1.6895
quadrupole: 14.4719 -12.8055 -1.6663 9.0887 -1.1051 -1.6895
hfenergy: -1605.5995573 hartree
pointgroup: C01[X(C12H6Cl2O3)]
dipole: 0.8369424 -2.2184782 0.2250609 debye
dipolederiv: -0.9736259 0.1011599 0.1192779 0.1955256 -0.1261419 -0.1134262 0.2013434 -0.1011515 -0.041982 -0.270691 0.074422 0.0385936 -0.0821228 -0.4634812 -0.3317468 -0.1222132 -0.2793249 -0.2041543 -0.5014102 -0.4693939 0.0660408 -0.058195 -1.0674478 0.1243893 -0.0055541 0.1838747 -0.4056064 -0.4576955 -0.2183766 0.0311067 -0.0306149 -0.8125429 0.0564103 0.0280403 0.0878073 -0.2893796 -0.4976695 0.2927398 -0.0010078 0.1040707 -0.9192473 -0.0057139 0.0265956 -0.0142488 -0.2933436 -0.1505883 -0.1586853 0.0396085 -0.1358213 0.1229241 0.0007339 0.0596029 -0.0222628 0.0238914 -0.3048887 0.2602079 -0.0119747 0.2708727 -0.4025932 0.0251322 -0.0004408 0.0273396 0.0222603 0.8624619 0.0690658 -0.1147675 -0.2701247 1.1623675 -0.1915746 -0.0614786 -0.1576402 0.1331643 -0.2972712 0.0028965 0.0157013 0.2891299 -0.8910513 0.0505472 -0.0018162 0.0812822 -0.0731029 0.6321676 -0.0468688 -0.0322557 -0.1792432 1.0585999 -0.078717 -0.0415455 -0.1202031 0.1735071 0.2318841 0.0343767 -0.0210422 -0.0302393 1.3006235 -0.0130129 0.0327963 -0.0266303 0.171657 -0.1752353 0.2924535 -0.0281661 0.0550426 -0.0637086 -0.0163031 0.0028638 -0.023287 -0.1128452 -0.0982465 -0.0146501 0.004416 0.2312451 0.0573837 -0.0299669 -0.0293967 -0.0121821 -0.0852974 0.1022957 -0.2329579 0.0037907 -0.1394905 0.0975778 -0.0176845 -0.0045488 -0.0066239 -0.1245244 0.1157172 0.0039456 -0.0279682 -0.1132546 -0.0656911 0.0040114 -0.0086829 -0.0049821 -0.1427371 -0.0425002 0.0697196 0.0550329 -0.2506612 -0.2502116 -0.0855877 -0.1314632 -0.1384906 -0.0958191 1.2715293 -0.1803731 -0.227103 -0.0775655 0.7250928 0.6282465 -0.1105475 0.5580124 0.1877703 0.111436 -0.0650217 0.011388 -0.0514452 0.0333177 0.0145443 0.0023131 0.0172731 0.1558819 0.0888483 -0.0096766 0.0065001 -0.0733157 0.0280227 0.0174602 0.0154878 0.0117083 0.152498 0.0242419 0.0811143 -0.0007286 0.1066005 -0.043571 0.0136985 -0.0020688 0.0121624 0.1543061 -0.1044912 0.0121362 0.0186341 -0.0003322 0.0958447 0.0066927 0.0193417 0.0055256 0.1580514 0.090781 -0.0465577 -0.0101614 0.1508555 0.1137165 -0.0500554 0.021267 -0.0216384 0.1470829 0.3429503 0.1483239 0.0650846 0.0890833 0.310217 -0.0080774 0.1101046 -0.0563198 0.3887214 unknown
polarizability: 276.3553682|-17.6045831|184.6035442|-3.316976|3.4129017|68.3175774 unknown
InChI: InChI=1S/C12H6Cl2O3/c13-9(14)5-8-10(15)6-3-1-2-4-7(6)11(16)12(8)17/h1-5,15H
charge 0 multiplicity 1
23 atoms
Cl -5.308753 0.071865 0.329502
Cl -3.464005 -1.909824 -0.999654
O  -0.77809 -2.088752 0.481992
O  1.662028 2.840888 -0.28279
O  -1.094231 2.740031 0.142598
C  1.170878 -0.790151 0.136129
C  1.858809 0.446186 -0.04429
C  -0.302111 -0.81785 0.239664
C  -1.099298 0.331091 0.163736
C  1.102657 1.725516 -0.101832
C  -0.437769 1.658507 0.072197
C  1.916536 -1.994095 0.201954
C  3.268988 0.463557 -0.161162
C  3.323276 -1.965765 0.088311
C  4.003934 -0.737937 -0.095014
C  -2.558137 0.430995 0.326198
C  -3.599657 -0.354533 -0.042085
H  1.386177 -2.939215 0.339171
H  3.762865 1.430763 -0.300284
H  3.889009 -2.901826 0.14145
H  5.094917 -0.721513 -0.183633
H  -2.858078 1.392838 0.769367
H  -1.765047 -2.174377 0.382376
