program: Gaussian 09
title: 000282296
version: EM64L-G09RevD.01
frameworkgroup: C1[X(C12H14N4O5)]
method: RPBEPBE
basis: SDD
operation: Freq
keyword: #p
keyword: freq=noraman
keyword: PBEPBE/SDD
title: #p freq=noraman PBEPBE/SDD
converged: YES YES NO NO
title: Mulliken charges:
elementType: O O O O O N N N N C C C C C C C C C C C C H H H H H H H H H H H H H H
charge: -0.276616 -0.274031 -0.283373 -0.288978 -0.247855 -0.415674 0.021593 -0.335212 -0.336944 -0.185823 -0.128057 -0.175095 0.341091 -0.359882 0.405875 -0.688249 -0.692056 -0.098043 -0.095136 0.160241 0.180653 0.322678 0.251034 0.285810 0.217884 0.258509 0.267307 0.217378 0.219166 0.217449 0.242940 0.220346 0.369475 0.339367 0.342228
chargesum: 0.00000
title: Mulliken charges with hydrogens summed into heavy atoms:
elementType: O O O O O N N N N C C C C C C C C C C C C
charge: -0.276616 -0.274031 -0.283373 -0.288978 -0.247855 -0.046199 0.021593 0.004155 0.005284 0.136856 0.122977 0.110715 0.341091 0.116511 0.405875 0.015602 -0.011320 -0.098043 -0.095136 0.160241 0.180653
polarizability: 2.37621960e+02 -6.52648917e+00 1.67656313e+02 1.07850015e+01 -3.58448711e-01 1.06264881e+02
1716.lowfreq: -14.6303 -6.3709 -0.0010 -0.0006 -0.0001 4.4650 24.4448 26.0168 63.2492
frequency: 23.5208 25.6570 63.2315 69.8610 101.8012 107.5384 121.3952 163.1025 183.7221 205.7594 220.9809 226.8186 240.9811 262.1909 295.1808 302.3247 330.4485 346.8841 370.7671 377.5524 393.5861 411.3349 461.1928 480.0419 530.8432 562.5473 584.0591 601.3816 612.9202 620.3384 638.8578 649.1593 700.6149 709.9794 715.5496 731.0249 766.0502 779.9979 799.7416 817.8158 824.4165 844.1248 854.1454 887.4840 922.5275 931.6452 955.5311 987.2637 997.6685 1003.1356 1024.1175 1038.4801 1044.3486 1074.2419 1104.0516 1126.9619 1140.3824 1183.7948 1187.7081 1204.9444 1228.5805 1248.5330 1255.5760 1264.7003 1269.9894 1276.5172 1317.0341 1319.3890 1332.6678 1355.4374 1364.6876 1379.2269 1381.5477 1393.4596 1423.9893 1425.6170 1451.0868 1454.5053 1457.6120 1465.2776 1470.7581 1483.7293 1561.6033 1618.1751 1653.0447 2972.8188 2993.0264 3007.5426 3045.3307 3063.9830 3079.3952 3094.2971 3102.7928 3109.5107 3113.1015 3121.9668 3545.3792 3555.4920 3570.5211
redmass: 4.5418 6.6731 4.7944 5.6884 4.0925 8.6813 5.7267 1.0752 5.8532 5.1594 5.1555 4.8194 1.1201 3.8162 3.8810 4.5233 4.6395 3.3650 1.6123 2.8449 4.2407 3.6914 11.9454 3.8966 8.1990 1.2147 5.3301 7.2862 5.7574 5.3107 6.6918 6.9561 6.9049 8.4125 4.4905 6.2256 8.0680 4.1867 1.5547 3.6111 3.7641 4.1226 4.9645 3.0293 1.7146 2.6556 2.3971 1.3056 4.7807 5.7656 3.4198 4.0513 2.8087 2.6464 4.0673 4.6448 1.8565 1.2985 1.6108 2.6160 1.5059 2.0046 3.1934 1.5755 2.7262 1.6805 3.2889 1.4018 1.3787 1.2728 1.4046 1.4235 2.1070 1.2273 5.5956 8.0923 1.0535 1.0766 1.0575 1.9676 1.0640 1.0476 6.6875 5.8221 7.3073 1.0679 1.0351 1.0355 1.0852 1.0881 1.0896 1.0997 1.1010 1.0995 1.0975 1.1009 1.0797 1.0794 1.0820
irintensity: 0.4118 0.1624 0.4631 0.5637 4.0176 8.9956 3.9623 0.1566 3.8879 3.0724 1.0189 5.5008 1.4601 5.0735 7.1730 3.7862 3.7731 9.6342 2.2226 0.9339 14.4573 4.2212 1.8966 13.2564 6.9499 216.9956 2.3172 1.0495 2.2250 6.3753 19.6986 0.6197 51.5308 16.1640 8.8378 7.3829 6.8533 16.6901 28.4473 74.9038 45.5552 5.9683 12.5140 7.5255 4.0975 27.9655 4.2787 0.9989 107.3620 37.0350 118.2968 85.3433 23.9547 32.2401 49.5364 17.4260 37.0148 5.5607 58.1032 82.8351 30.7077 52.7540 79.1083 4.9157 11.6450 33.6942 37.9084 8.7593 5.7753 21.5660 4.0089 28.5772 17.7057 31.2583 45.2765 13.1882 6.3955 3.5510 9.3667 0.1001 0.2189 11.7030 69.6724 551.0660 122.7167 47.6670 17.9357 16.0625 2.6286 25.4352 14.9171 7.7966 7.6620 23.5464 15.8384 20.1231 6.8836 152.9109 124.1788
temp: 298.150 k
press: 1.00000 atm
elementType: 8 8 8 8 8 7 7 7 7 6 6 6 6 6 6 6 6 6 6 6 6 1 1 1 1 1 1 1 1 1 1 1 1 1 1
symmnumber: 1
zpe: 694860.7 jmol-1
zpe.correction: 0.264658 hartree
zpe.thermalcorrener: 0.283172 hartree
zpe.thermalcorrenthalpy: 0.284116 hartree
zpe.thermalcorrgfe: 0.217194 hartree
zpe.sumelectzpe: -1059.207421 hartree
zpe.sumelectthermal: -1059.188908 hartree
zpe.sumelectthermalent: -1059.187964 hartree
zpe.sumelectthermalfe: -1059.254886 hartree
dipole: -1.4611 1.5962 0.7213
dipole: 2.2810
quadrupole: -131.6101 -120.3521 -119.9376
quadrupole: 28.8088 2.6091 1.6490
quadrupole: -7.6435 3.6145 4.0290 28.8088 2.6091 1.6490
hfenergy: -1059.4720798 hartree
pointgroup: C01 [X(C12H14N4O5)]
dipole: 0.5314734 0.4310441 -0.5805962 debye
polarizability: 235.5573165|17.4119592|153.4798538|5.7969425|-27.0050651|122.5059845 unknown
InChI: InChI=1S/C12H14N4O5/c1-12(2)20-4-3-19-9(8(4)21-12)6-5-7(14-13-6)11(18)16-15-10(5)17/h4,8-9,13,15-16H,3H2,1-2H3
charge 0 multiplicity 1
35 atoms
O  2.614357 1.502739 -0.121574
O  3.738726 -0.325458 -1.097312
O  1.624885 -1.24268 1.229884
O  -1.047554 2.154872 -1.177743
O  -5.247231 -1.166748 0.329551
N  -1.050813 -1.505415 1.367738
N  -2.408531 -1.744095 1.252277
N  -3.2739 1.532697 -1.110863
N  -4.343357 0.683008 -0.732175
C  1.568475 0.52194 -0.438454
C  2.325157 -0.717166 -1.035475
C  0.876373 -0.01374 0.842918
C  3.956132 0.864503 -0.226729
C  2.039164 -1.874998 -0.05525
C  -0.588551 -0.387232 0.698598
C  4.470829 0.445178 1.158206
C  4.880844 1.827424 -0.966935
C  -1.739859 0.164151 0.092985
C  -2.827054 -0.705331 0.467717
C  -1.935125 1.345594 -0.755201
C  -4.225667 -0.476891 0.054725
H  0.854829 1.019898 -1.111933
H  2.022715 -0.9630 -2.066167
H  1.010541 0.710164 1.665631
H  1.21986 -2.51948 -0.43567
H  2.933886 -2.480503 0.151799
H  3.762689 -0.243234 1.649069
H  5.449702 -0.055462 1.057551
H  4.596161 1.339291 1.793778
H  5.870362 1.363111 -1.117254
H  4.447818 2.0804 -1.947491
H  5.007632 2.753504 -0.381007
H  -0.457758 -2.139992 1.906033
H  -3.505269 2.325396 -1.714031
H  -5.276765 0.949555 -1.053795
