program: Gaussian 09
title: 000282294
version: EM64L-G09RevD.01
frameworkgroup: C1[X(C11H20N2O4)]
method: RPBEPBE
basis: SDD
operation: Freq
keyword: #p
keyword: freq=noraman
keyword: PBEPBE/SDD
title: #p freq=noraman PBEPBE/SDD
converged: YES YES NO NO
title: Mulliken charges:
elementType: O O O O N N C C C C C C C C C C C H H H H H H H H H H H H H H H H H H H H
charge: -0.294793 -0.286841 -0.282727 -0.335607 -0.394760 -0.151296 -0.155409 -0.107333 -0.083671 0.353003 -0.321979 -0.406838 -0.679698 -0.690384 0.303435 -0.630208 -0.661482 0.249965 0.252991 0.248266 0.208556 0.232224 0.248246 0.271365 0.229029 0.227633 0.223682 0.223086 0.231660 0.221774 0.326965 0.217682 0.218751 0.285846 0.235025 0.236783 0.237060
chargesum: 0.00000
title: Mulliken charges with hydrogens summed into heavy atoms:
elementType: O O O O N N C C C C C C C C C C C
charge: -0.294793 -0.286841 -0.282727 -0.335607 -0.067795 -0.151296 0.094555 0.145659 0.164595 0.353003 0.118801 0.112773 0.000646 -0.013864 0.303435 0.092072 0.047385
polarizability: 1.85075462e+02 -5.53159827e+00 1.33597461e+02 6.54042253e+00 3.78718702e+00 1.14456300e+02
1716.lowfreq: -7.7844 -4.3259 -0.0004 -0.0001 0.0004 6.0859 12.1751 29.8563 37.0753
frequency: 11.2548 29.6644 37.0139 41.1819 71.9592 75.1927 116.1944 128.7788 135.7188 159.1777 160.9904 202.8219 218.6045 222.6519 254.5029 281.0803 304.8417 313.7976 359.3147 366.9778 393.2034 439.8656 466.6416 471.9864 528.9944 538.3148 558.9015 590.7611 647.1016 675.1001 708.1302 716.7511 746.2604 755.1775 792.0260 826.9672 847.7869 883.5090 920.5939 943.2032 958.7802 977.5913 982.3104 998.7666 1014.4034 1027.9682 1059.0616 1060.3663 1079.8679 1095.9994 1099.4613 1117.9540 1136.2042 1138.2461 1166.5955 1201.2548 1208.8526 1225.1888 1230.2233 1250.9175 1259.6333 1264.3196 1281.7761 1295.6613 1305.7396 1317.7096 1337.2182 1347.4063 1372.4107 1379.1886 1391.9884 1415.2723 1445.2361 1449.8908 1451.0288 1452.1859 1468.9259 1471.7815 1474.3313 1475.4992 1477.7213 1490.7579 1498.9454 1506.4804 1605.8141 2937.5667 2957.4678 2981.7787 2996.6002 3005.5234 3013.1099 3014.8438 3022.4161 3027.8112 3041.3639 3061.4798 3090.4336 3091.2371 3097.5969 3099.1940 3101.1983 3110.0598 3110.7818 3116.6430 3564.7995
redmass: 3.7205 4.1247 3.8202 4.2497 3.5950 1.7182 2.8786 2.3268 3.2299 1.2886 1.0447 2.0924 2.6630 1.0979 4.0416 3.0693 3.0671 3.0330 3.1033 3.7714 2.8375 2.9870 2.8437 3.7026 3.6677 1.5566 3.7920 3.0237 5.9948 3.3484 9.5970 6.1946 3.2834 4.3345 4.2006 4.5251 3.6783 3.5970 1.5320 2.1325 3.3540 3.3127 1.3332 2.1911 3.3642 3.2965 1.9108 1.7281 3.0468 1.2934 2.2344 2.6584 1.3424 1.9613 1.2656 2.4920 2.0755 1.7067 1.2597 1.3767 2.4674 4.9179 1.3222 1.3017 1.2959 1.2840 1.3356 2.0023 1.5353 1.2925 1.2275 1.1560 1.1560 1.0527 1.1064 1.0539 1.0695 1.0477 1.0925 1.0889 1.1279 1.0489 1.1127 1.7931 5.7561 1.0406 1.0370 1.0659 1.0356 1.0356 1.0973 1.0837 1.0636 1.1020 1.0857 1.0882 1.1026 1.0958 1.1012 1.1003 1.1003 1.0997 1.0959 1.1005 1.0764
irintensity: 1.0819 2.0453 2.1671 3.0408 2.7726 5.9079 8.1763 1.0186 1.3170 1.5622 0.0527 0.7909 3.5508 1.3163 4.0529 2.5854 1.0651 2.4065 2.3540 33.7455 4.1946 3.4647 1.9438 13.1164 21.9053 91.9591 14.1618 17.5017 0.5259 1.0030 9.2323 18.9614 2.1749 38.7446 4.7322 13.6504 51.2374 2.0175 2.8022 3.4753 45.0338 29.1012 3.8929 63.9833 27.1612 86.2027 4.1960 22.8442 55.4326 5.4942 30.7096 2.7896 1.3223 42.9030 1.8002 204.0172 63.0289 14.0921 53.3706 21.3923 34.1678 2.8126 1.8373 6.0253 0.3620 3.0568 0.7736 66.3021 15.1618 49.5214 28.5061 35.0304 1.9377 4.0291 32.5154 3.8294 6.0038 25.4130 22.2872 69.0314 111.4131 8.6504 16.9662 373.4299 249.6423 59.2161 105.4184 47.5503 9.9879 10.6477 39.2493 12.0262 24.7152 50.2748 40.4311 29.9137 5.2436 22.9999 35.8287 34.3002 1.9646 27.7779 1.2685 27.4427 20.3540
temp: 298.150 k
press: 1.00000 atm
elementType: 8 8 8 8 7 7 6 6 6 6 6 6 6 6 6 6 6 1 1 1 1 1 1 1 1 1 1 1 1 1 1 1 1 1 1 1 1
symmnumber: 1
zpe: 811378.2 jmol-1
zpe.correction: 0.309038 hartree
zpe.thermalcorrener: 0.327895 hartree
zpe.thermalcorrenthalpy: 0.328839 hartree
zpe.thermalcorrgfe: 0.259298 hartree
zpe.sumelectzpe: -840.196063 hartree
zpe.sumelectthermal: -840.177205 hartree
zpe.sumelectthermalent: -840.176261 hartree
zpe.sumelectthermalfe: -840.245802 hartree
dipole: 0.8898 2.8417 0.4376
dipole: 3.0097
quadrupole: -88.8540 -108.6203 -98.0093
quadrupole: -15.8380 -4.3110 0.3048
quadrupole: 9.6405 -10.1258 0.4852 -15.8380 -4.3110 0.3048
hfenergy: -840.5051002 hartree
pointgroup: C01 [X(C11H20N2O4)]
dipole: 0.3596939 -1.1243538 0.0926903 debye
polarizability: 185.1597889|4.374658|134.3596667|-6.8239784|-0.9040036|113.6097675 unknown
InChI: InChI=1S/C11H20N2O4/c1-11(2)16-8-6-15-7(9(8)17-11)5-12-10(14)13(3)4/h7-9,12H,5-6H2,1-4H3
charge 0 multiplicity 1
37 atoms
O  2.078499 0.836298 -0.410441
O  3.655612 -0.772076 0.326561
O  0.112954 -1.635516 0.719509
O  -3.074639 1.859545 -0.060188
N  -2.013628 -0.178035 -0.50202
N  -4.369186 -0.087183 -0.291405
C  1.566755 0.313483 0.878679
C  2.397684 -0.991455 1.05379
C  0.094191 -0.128894 0.76794
C  3.517457 0.498113 -0.470899
C  1.489361 -2.063586 0.403209
C  -0.673948 0.410378 -0.453881
C  4.376236 1.58194 0.19561
C  3.876204 0.221811 -1.92781
C  -3.149773 0.602417 -0.268049
C  -5.602023 0.653059 0.00938
C  -4.46125 -1.525737 -0.570033
H  1.726464 1.054729 1.682531
H  2.635933 -1.220091 2.10546
H  -0.462227 0.124324 1.688001
H  1.671215 -2.081318 -0.690312
H  1.61785 -3.073923 0.821514
H  -0.109462 0.184188 -1.374803
H  -0.795525 1.504693 -0.380814
H  5.430988 1.25918 0.224279
H  4.043899 1.763026 1.23219
H  4.304798 2.526958 -0.370032
H  3.740401 1.1342 -2.533379
H  3.230551 -0.575234 -2.330422
H  4.928514 -0.100624 -2.000606
H  -2.052988 -1.197419 -0.490124
H  -6.100391 0.253599 0.914844
H  -6.313164 0.60402 -0.838398
H  -5.327721 1.704734 0.18474
H  -4.050332 -2.148523 0.252886
H  -3.939155 -1.792157 -1.510183
H  -5.521456 -1.800128 -0.694021
