program: Gaussian 09
title: 000022514
version: EM64L-G09RevD.01
frameworkgroup: C1[X(C20H32NO)]
method: RPBEPBE
basis: SDD
operation: Freq
keyword: #p
keyword: freq=noraman
keyword: PBEPBE/SDD
title: #p freq=noraman PBEPBE/SDD
converged: NO YES NO NO
title: Mulliken charges:
elementType: O N C C C C C C C C C C C C C C C C C C C C H H H H H H H H H H H H H H H H H H H H H H H H H H H H H H H H
charge: -0.482425 -0.084659 -0.430248 0.187100 -0.085971 -0.358679 -0.351718 -0.504481 -0.442834 -0.421704 -0.455841 -0.439626 -0.610280 -0.411881 -0.414134 -0.386896 0.349116 -0.401919 -0.423001 -0.250744 -0.224063 -0.237037 0.303854 0.297012 0.200300 0.279628 0.271326 0.266602 0.282170 0.230501 0.258772 0.279254 0.237288 0.276613 0.243962 0.217958 0.189011 0.246946 0.164704 0.276295 0.263342 0.276379 0.213993 0.195494 0.200345 0.218552 0.219479 0.195787 0.348818 0.230764 0.265390 0.241329 0.242640 0.247422
chargesum: 1.00000
title: Mulliken charges with hydrogens summed into heavy atoms:
elementType: O N C C C C C C C C C C C C C C C C C C C C
charge: -0.133607 -0.084659 0.170617 0.187100 0.114329 0.192275 0.197054 -0.015208 0.073707 0.098870 -0.048873 -0.027977 0.205736 -0.002395 0.004763 0.028370 0.349116 -0.171155 -0.157611 -0.009415 0.018577 0.010385
polarizability: 2.19177116e+02 1.39645210e+01 2.27063918e+02 4.96009970e-01 -5.70461776e-01 1.88031526e+02
1716.lowfreq: -30.3360 -16.2469 -7.7342 -4.9294 0.0002 0.0003 0.0005 17.6249 37.1327
frequency: -27.3485 15.5002 36.9490 42.3226 50.5339 62.8387 68.6535 103.9527 150.6079 184.1311 189.3991 197.4742 209.0072 234.5185 253.3207 273.6889 286.8130 295.0736 316.7190 332.1679 336.1994 355.6157 371.4960 403.6496 410.4170 426.4251 432.7286 448.6072 474.2811 494.3169 502.2372 552.2187 575.4496 615.2725 618.3522 662.1248 709.8164 716.0910 732.8202 770.7116 784.0636 793.9905 806.6749 811.4567 836.3784 849.8302 864.1445 865.4863 892.2091 893.4953 903.8030 909.2776 918.0493 920.9393 931.9435 932.9903 971.1141 982.7959 985.1473 990.1684 995.8796 1006.3085 1011.6531 1027.4310 1050.6178 1053.1396 1056.3026 1066.1098 1068.2990 1076.9251 1085.3647 1095.9576 1113.9473 1118.5627 1135.9659 1144.5711 1160.8405 1170.2556 1177.6982 1184.2729 1191.4273 1203.5336 1221.9679 1230.4312 1244.3712 1250.5404 1256.4519 1266.6166 1268.4036 1278.9076 1294.1158 1304.4724 1309.6671 1310.6548 1313.2347 1319.0764 1324.7179 1327.8188 1335.7770 1340.1519 1344.6643 1346.5301 1352.4417 1364.6866 1376.5249 1379.7001 1432.5159 1435.1008 1453.9771 1456.0362 1464.9534 1466.6871 1468.7908 1470.8026 1471.0755 1474.3234 1476.4028 1477.2537 1477.5755 1480.8429 1491.3878 1494.0148 1587.7914 1606.3955 2915.9397 2965.4413 2966.7485 2970.6779 2974.2353 2977.4736 3014.6707 3020.6740 3024.2276 3026.3679 3028.0356 3028.7424 3035.9347 3039.1750 3041.0527 3042.9610 3049.1477 3051.5927 3083.6946 3096.7519 3103.1019 3110.3216 3114.6486 3123.0391 3128.1698 3135.0824 3135.9637 3145.2801 3150.5239 3155.4685 3171.3120 3556.3359
redmass: 3.0189 3.3213 2.8750 3.2013 3.9410 3.6814 3.5780 3.0482 2.7895 3.4523 3.4363 2.3997 2.1929 2.6051 2.4444 3.3408 1.7913 1.7165 1.8584 1.8919 1.5268 2.3459 2.2418 2.8389 2.6827 3.1283 3.1204 2.3990 2.2926 3.3082 2.0452 1.9308 3.8342 6.3786 3.9285 3.3477 2.5954 1.8035 3.0886 2.0044 1.4863 2.0638 2.3894 1.8160 1.6437 1.9337 1.2450 2.1560 2.1297 1.4649 2.0903 2.2426 2.2510 2.5426 1.9872 1.5254 2.4596 2.0078 2.0668 2.4620 2.3747 1.6739 1.7708 2.2124 2.1270 1.6853 1.7147 1.7476 1.5831 1.7426 1.5826 1.6495 2.1627 2.3029 1.7016 1.8948 1.6628 1.5817 1.0634 1.5463 1.1342 1.7916 1.4564 1.5771 1.3029 1.3342 1.3223 1.3431 1.3358 1.4204 1.2979 1.2884 1.2872 1.3653 1.3488 1.3613 1.2759 1.3216 1.3045 1.3541 1.4740 1.4873 1.3364 1.4958 3.0965 1.6331 2.1401 1.1560 1.0884 1.0936 1.0854 1.0868 1.0815 1.0805 1.0822 1.0711 1.1150 1.1239 1.9501 1.0545 1.0934 1.0663 6.0336 6.0348 1.0684 1.0675 1.0742 1.0654 1.0659 1.0606 1.0612 1.0662 1.0338 1.0787 1.0769 1.0627 1.0931 1.0987 1.0611 1.0956 1.0616 1.1032 1.1001 1.0997 1.1033 1.1062 1.0880 1.1083 1.1087 1.0863 1.1054 1.0915 1.1040 1.0948 1.1012 1.0657
irintensity: 0.1443 0.1317 0.2910 0.2397 0.3511 0.1597 1.1900 0.3022 3.5173 2.4966 3.8541 0.2317 0.9559 1.4342 1.1626 1.0436 3.5229 3.7099 51.1024 24.0938 71.9054 6.0023 1.1993 0.0627 12.4345 0.9062 0.9413 3.2392 6.5415 2.6332 1.1149 6.1498 12.6065 0.2001 4.6420 11.3620 6.4450 59.8009 2.6699 33.4005 0.8608 6.6520 2.8970 10.7348 17.2810 4.8220 0.5808 15.7530 18.9667 18.4147 8.8061 26.4768 9.0809 5.8717 4.9977 6.6016 2.2658 8.1284 0.9063 1.9485 2.5328 19.5831 24.4438 7.0551 18.6494 7.7389 0.9009 0.2470 7.4143 1.0261 3.9713 0.1582 0.2799 1.1884 6.2697 3.2320 0.3442 3.2067 0.4740 7.1321 0.1516 10.5275 4.7130 14.0384 0.1165 0.3604 3.2861 16.7990 4.3916 33.9926 19.5832 18.6116 15.7336 6.1827 3.0700 30.0033 0.1356 20.5149 1.4502 2.7165 7.0340 3.4579 2.0894 0.1849 3.2680 6.0460 12.1545 22.4900 4.8476 0.5553 8.2146 5.2334 13.8331 39.8081 14.5028 9.5579 10.4969 0.7494 19.0889 18.5484 8.0205 20.8930 1.7094 2.1219 30.7052 22.3640 26.1913 34.0929 23.2757 33.0797 5.3319 10.1661 4.1316 41.7269 31.8580 10.8023 34.3210 39.2486 5.7426 38.6696 6.2672 74.7953 11.8719 1.6924 8.4986 7.4990 10.3962 3.3829 9.3430 0.1247 6.7622 7.9700 5.4239 14.2933 14.7803 14.7488
temp: 298.150 k
press: 1.00000 atm
elementType: 8 7 6 6 6 6 6 6 6 6 6 6 6 6 6 6 6 6 6 6 6 6 1 1 1 1 1 1 1 1 1 1 1 1 1 1 1 1 1 1 1 1 1 1 1 1 1 1 1 1 1 1 1 1
symmnumber: 1
zpe: 1270327.5 jmol-1
zpe.correction: 0.483842 hartree
zpe.thermalcorrener: 0.504932 hartree
zpe.thermalcorrenthalpy: 0.505877 hartree
zpe.thermalcorrgfe: 0.433298 hartree
zpe.sumelectzpe: -909.355234 hartree
zpe.sumelectthermal: -909.334143 hartree
zpe.sumelectthermalent: -909.333199 hartree
zpe.sumelectthermalfe: -909.405778 hartree
dipole: 10.2913 -3.3981 -0.6530
dipole: 10.8575
quadrupole: -69.6729 -110.1905 -121.3807
quadrupole: -11.7130 -1.5465 0.5956
quadrupole: 30.7418 -9.7758 -20.9660 -11.7130 -1.5465 0.5956
hfenergy: -909.8390757 hartree
pointgroup: C01 [X(C20H32N1O1)]
dipole: -4.1784482 0.8666673 -0.1913049 debye
polarizability: 216.0585858|12.7062177|230.081414|-0.3030947|1.9918575|188.132561 unknown
InChI: InChI=1S/C20H32NO/c1-21(15-8-9-16-21)17-14-20(22,18-10-4-2-5-11-18)19-12-6-3-7-13-19/h2,4-5,10-11,19,22H,3,6-9,12-17H2,1H3
charge 1 multiplicity 1
54 atoms
O  0.767327 0.565868 1.892353
N  -3.103902 1.0557 0.232908
C  -1.735252 0.538519 0.732546
C  0.768941 0.341084 0.428517
C  2.07343 0.937984 -0.217659
C  -3.35845 0.637785 -1.247272
C  -4.249977 0.368073 1.055537
C  -0.520987 1.091434 -0.0294
C  -4.822738 0.174289 -1.289273
C  -4.984736 -0.554581 0.065675
C  2.214713 2.475968 -0.062351
C  3.341718 0.22596 0.337038
C  -3.199204 2.5676 0.386431
C  3.517598 2.998962 -0.718693
C  4.633286 0.745344 -0.33847
C  4.771261 2.275201 -0.178822
C  0.634229 -1.166571 0.100648
C  0.603788 -1.604224 -1.250869
C  0.511421 -2.134424 1.12809
C  0.467005 -2.974521 -1.564933
C  0.38008 -3.508142 0.81568
C  0.35668 -3.934155 -0.531157
H  -1.652845 0.805469 1.798988
H  -1.78131 -0.561222 0.648556
H  2.026125 0.711802 -1.304164
H  -2.6742 -0.198335 -1.466592
H  -3.119528 1.486617 -1.905215
H  -4.907797 1.169573 1.42797
H  -3.795423 -0.151704 1.911973
H  -0.629382 0.965242 -1.122198
H  -0.384635 2.162269 0.192554
H  -5.005695 -0.485101 -2.152678
H  -5.517539 1.030079 -1.368764
H  -6.038937 -0.690036 0.355396
H  -4.514264 -1.553026 0.028479
H  2.207584 2.737263 1.01524
H  1.357573 3.000721 -0.52799
H  3.257522 -0.868515 0.204844
H  3.43901 0.418804 1.43023
H  -2.400659 3.049083 -0.195076
H  -4.18048 2.904866 0.018097
H  -3.090213 2.827319 1.451018
H  3.602261 4.089418 -0.551362
H  3.457746 2.849677 -1.816823
H  4.610468 0.485484 -1.416705
H  5.511224 0.230078 0.093966
H  5.674322 2.635445 -0.705818
H  4.907792 2.522497 0.894067
H  1.662331 0.340518 2.25257
H  0.70868 -0.88218 -2.070555
H  0.519727 -1.809213 2.173497
H  0.460502 -3.295044 -2.612529
H  0.300985 -4.24341 1.623944
H  0.262628 -4.997888 -0.773442
