program: Gaussian 09
title: 000282362
version: EM64L-G09RevD.01
frameworkgroup: C1[X(C20H19NO4S)]
method: RPBEPBE
basis: SDD
operation: Freq
keyword: #p
keyword: freq=noraman
keyword: PBEPBE/SDD
title: #p freq=noraman PBEPBE/SDD
converged: YES YES NO NO
title: Mulliken charges:
elementType: S O O O O N C C C C C C C C C C C C C C C C C C C C H H H H H H H H H H H H H H H H H H H
charge: 0.966021 -0.399105 -0.246604 -0.519038 -0.501633 -0.451910 -0.075912 -0.552466 0.236482 -0.526485 0.069488 -0.327313 0.110913 0.118462 0.233760 -0.423930 -0.361474 -0.255200 -0.224168 -0.045492 -0.247113 -0.203915 0.452872 -0.332736 -0.393452 -0.800966 0.214660 0.230180 0.253613 0.237279 0.245754 0.236152 0.228618 0.323479 0.246554 0.239614 0.227173 0.226121 0.285712 0.301214 0.245615 0.252053 0.238504 0.238900 0.229723
chargesum: 0.00000
title: Mulliken charges with hydrogens summed into heavy atoms:
elementType: S O O O O N C C C C C C C C C C C C C C C C C C C C
charge: 0.966021 -0.399105 -0.246604 -0.519038 -0.501633 -0.128431 0.138748 -0.068673 0.236482 -0.043452 0.069488 0.137458 0.110913 0.118462 0.233760 -0.177375 -0.121860 -0.028027 0.001952 -0.045492 0.038598 0.097298 0.452872 -0.087122 -0.141399 -0.093840
polarizability: 2.78193311e+02 5.74865963e+01 2.56877460e+02 7.28266377e+00 -2.55454927e+01 2.41234688e+02
1716.lowfreq: -13.6039 -10.3966 -4.9893 -0.0016 -0.0015 -0.0014 7.3430 18.0866 22.3471
frequency: -6.3090 17.9501 22.2811 26.6859 41.9331 50.0468 57.2036 93.6858 98.2539 124.5525 127.7750 141.5262 159.4107 181.6100 199.5043 230.1069 249.6609 260.8720 294.9912 303.1593 315.3454 321.7393 350.3642 371.7451 382.8495 395.5181 406.8278 421.2479 439.8843 469.4413 479.0952 503.3533 522.5414 543.6237 559.6499 578.3726 584.9552 595.9658 600.4179 620.2679 626.4045 676.9565 688.9494 703.0325 757.0915 760.3572 778.3835 781.7258 810.0125 825.3261 832.0578 841.2102 846.8784 856.6053 881.1309 900.4032 913.9751 938.3496 943.2912 948.7511 960.2343 964.2681 977.0806 984.3792 985.8510 995.4780 1008.2604 1038.5866 1049.7779 1051.9720 1057.5453 1108.2024 1121.6583 1125.0607 1165.4492 1173.1925 1185.0438 1187.6923 1197.5185 1218.1206 1219.1032 1241.4604 1244.8778 1279.9081 1298.1522 1315.6867 1320.5688 1331.1066 1346.3891 1370.9777 1381.0581 1381.8431 1392.1694 1400.0200 1406.1925 1433.0811 1448.2033 1454.7788 1458.2123 1469.6020 1470.1299 1471.3996 1475.0666 1486.2211 1551.6336 1576.1288 1592.4915 1595.3612 1597.9521 1627.8076 2955.3342 2966.6903 2973.3690 2982.8168 2987.4153 3014.0289 3044.4307 3055.6553 3061.9006 3093.4968 3126.9855 3137.2485 3137.4138 3145.4660 3149.3516 3165.3160 3166.9486 3170.7404 3596.4257
redmass: 5.5116 5.4801 1.4512 2.4614 5.2291 4.3648 6.1117 4.7423 5.4312 5.9879 7.2104 3.8148 4.6716 4.3417 5.0675 7.9468 5.6492 5.4905 4.3731 4.8662 5.2081 3.6861 5.2369 2.5695 3.9838 4.2686 2.8708 3.3750 3.6065 6.8554 4.2065 4.8460 4.4969 4.3361 4.5831 4.7337 4.1676 6.1634 1.1068 6.9578 5.9640 5.2301 5.3955 3.3371 1.5844 2.7259 4.9241 4.0172 4.1032 2.3777 2.5017 4.5722 1.3101 1.4214 1.8651 4.0722 5.2116 1.9320 1.6574 10.1347 2.4102 1.3203 1.3045 1.3883 1.9542 2.6738 2.0878 2.8762 1.5901 2.4887 2.4166 1.8844 1.2888 1.6737 1.1673 1.1227 1.4640 1.7500 1.1408 2.5657 1.2986 1.5653 2.0139 1.4906 1.2623 1.6737 1.5634 2.1723 1.7331 1.4075 2.1598 3.1610 3.0458 1.3307 2.9632 1.0963 1.1226 3.9333 1.3312 1.0681 2.9825 2.3100 1.1217 3.2916 7.6898 6.0994 6.4925 6.4662 9.2130 7.4131 1.0667 1.0662 1.0615 1.0376 1.0746 1.0975 1.1061 1.0949 1.0974 1.0990 1.0852 1.0889 1.0895 1.0897 1.0956 1.1001 1.0956 1.0970 1.0805
irintensity: 2.3398 1.5244 0.4863 0.1789 0.0656 0.4019 0.2029 1.1603 0.7176 1.9117 1.1818 0.7843 5.0341 7.6090 7.7146 5.3081 4.4770 3.1961 5.0006 3.4054 1.3602 4.3789 2.8385 8.4740 3.9105 5.1546 0.0275 2.0221 13.6185 52.2242 10.0944 13.5702 102.7665 18.3491 0.6887 3.1542 7.6889 42.0793 106.0476 0.2350 0.3692 2.4441 0.4774 0.8680 93.5100 31.8177 5.3558 6.2079 6.2991 104.4280 17.4099 2.9140 1.9469 0.8190 7.1676 84.3011 25.8624 8.2082 2.2096 76.8029 5.5997 1.4885 0.1890 0.3811 2.7944 6.3539 4.7758 11.0019 12.6269 20.9480 2.1755 4.3093 7.9386 4.4139 0.1225 26.9755 4.6814 13.3324 4.9706 3.9158 4.5693 62.5847 15.9631 6.8295 2.6147 0.9502 4.5276 42.7752 53.6553 5.1595 9.7501 6.5408 11.6377 16.8469 6.6410 26.9742 18.3610 2.8766 24.2162 9.4713 30.8272 15.6517 17.1975 2.2526 54.4261 1.7108 14.4272 26.8062 324.3873 10.9168 13.4343 14.1914 11.8808 23.4063 96.4483 6.2429 10.8234 23.3240 14.3491 14.7933 0.1068 5.1325 9.9783 6.3221 22.5005 27.4294 1.7722 8.0026 78.3203
temp: 298.150 k
press: 1.00000 atm
elementType: 16 8 8 8 8 7 6 6 6 6 6 6 6 6 6 6 6 6 6 6 6 6 6 6 6 6 1 1 1 1 1 1 1 1 1 1 1 1 1 1 1 1 1 1 1
symmnumber: 1
zpe: 906645.5 jmol-1
zpe.correction: 0.345323 hartree
zpe.thermalcorrener: 0.368421 hartree
zpe.thermalcorrenthalpy: 0.369365 hartree
zpe.thermalcorrgfe: 0.290743 hartree
zpe.sumelectzpe: -1525.229522 hartree
zpe.sumelectthermal: -1525.206424 hartree
zpe.sumelectthermalent: -1525.205480 hartree
zpe.sumelectthermalfe: -1525.284102 hartree
dipole: 2.5480 3.5486 0.4773
dipole: 4.3946
quadrupole: -129.1603 -164.1623 -171.7515
quadrupole: 10.2692 16.8622 -6.7431
quadrupole: 25.8644 -9.1376 -16.7268 10.2692 16.8622 -6.7431
hfenergy: -1525.5748449 hartree
pointgroup: C01 [X(C20H19N1O4S1)]
dipole: 0.7507285 -1.5175768 -0.3502717 debye
polarizability: 259.7575564|-51.5825226|287.2563651|-18.2735532|-22.7835837|229.2915378 unknown
InChI: InChI=1S/C20H19NO4S/c1-13-6-8-15(9-7-13)26(23,24)25-12-14-10-17-16-4-2-3-5-18(16)21-20(17)19(22)11-14/h2-9,14,21H,10-12H2,1H3
charge 0 multiplicity 1
45 atoms
S  0.545625 2.1819 1.578215
O  -0.642065 2.172234 0.12611
O  -1.963566 0.894879 -3.394427
O  -0.183106 1.367826 2.782123
O  1.062716 3.693335 1.84723
N  -1.008922 -1.414654 -1.84335
C  -3.105265 1.76288 0.084182
C  -2.957048 0.376184 0.788374
C  -2.113545 -0.5813 -0.010851
C  -3.29354 1.648518 -1.457002
C  -1.827922 -0.380582 -1.369338
C  -1.970684 2.736346 0.474697
C  -2.296837 0.733889 -2.177198
C  -1.44197 -1.798243 0.375755
C  -0.755837 -2.299109 -0.799993
C  -1.324933 -2.510141 1.601808
C  0.013794 -3.484978 -0.767986
C  -0.553057 -3.685401 1.634631
C  0.105294 -4.168532 0.460266
C  1.902276 1.168035 0.792301
C  2.942192 1.861259 0.150032
C  1.839706 -0.228913 0.896005
C  3.969103 -0.326177 -0.348774
C  3.979401 1.094204 -0.41874
C  2.892714 -0.970344 0.314698
C  5.094808 -1.130533 -0.971814
H  -4.022928 2.24561 0.482843
H  -3.965625 -0.059227 0.94704
H  -2.516933 0.522223 1.794487
H  -3.254357 2.644328 -1.935273
H  -4.303252 1.236098 -1.666248
H  -2.021611 2.926727 1.565779
H  -2.067202 3.698911 -0.062399
H  -0.666593 -1.459342 -2.80212
H  -1.824174 -2.145963 2.50619
H  0.520211 -3.862712 -1.662866
H  -0.452999 -4.245656 2.570514
H  0.689769 -5.093858 0.518484
H  2.944539 2.954916 0.112532
H  1.014645 -0.725879 1.41481
H  4.806548 1.605121 -0.924825
H  2.86494 -2.063456 0.37854
H  5.160296 -0.946546 -2.060475
H  6.072691 -0.851583 -0.537339
H  4.953699 -2.213494 -0.819427
