program: Gaussian 09
title: 000282327
version: EM64L-G09RevD.01
frameworkgroup: C1[X(C22H18N2)]
method: RPBEPBE
basis: SDD
operation: Freq
keyword: #pfreq=noraman
keyword: PBEPBE/SDD
title: #p freq=noraman PBEPBE/SDD
converged: YES YES NO NO
title: Mulliken charges:
elementType: N N C C C C C C C C C C C C C C C C C C C C C C H H H H H H H H H H H H H H H H H H
charge: -0.081518 -0.088460 -0.115569 -0.646356 0.452466 0.341187 0.185004 -0.374930 -0.382937 -0.376447 -0.388268 -0.400299 -0.239934 -0.230098 -0.246712 -0.244559 0.449618 -0.242949 -0.241034 -0.404657 -0.372220 -0.242462 -0.235851 -0.236861 0.264937 0.265015 0.254085 0.285764 0.244650 0.239375 0.220610 0.226493 0.227725 0.226086 0.226080 0.229678 0.228235 0.226595 0.309905 0.228304 0.229588 0.230719
chargesum: 0.00000
title: Mulliken charges with hydrogens summed into heavy atoms:
elementType: N N C C C C C C C C C C C C C C C C C C C C C C
charge: -0.081518 -0.088460 -0.115569 -0.116404 0.452466 0.341187 0.185004 -0.120845 -0.097173 -0.131797 -0.148893 -0.179689 -0.013441 -0.002373 -0.020626 -0.018479 0.449618 -0.013271 -0.012799 -0.178063 -0.062316 -0.014158 -0.006263 -0.006142
polarizability: 4.21085356e+02 9.72790580e+00 2.13538518e+02 4.76531023e+00 2.21205005e+00 1.94974360e+02
1716.lowfreq: -6.6076 -3.6684 -0.0009 -0.0006 0.0004 5.2044 8.7148 18.4009 40.3658
frequency: 5.0824 18.3221 40.3543 43.9296 64.2068 72.0883 86.4053 124.2351 158.5789 193.0112 217.9611 242.5799 261.5351 275.0626 282.9165 312.2073 363.6996 381.3754 400.2777 404.3240 406.9589 432.4749 491.8595 513.8391 528.9466 568.0175 610.7605 613.6090 615.0309 616.5422 655.0542 670.6306 697.4421 699.5184 702.2862 708.8929 754.9322 766.5877 773.0646 784.0084 819.2795 836.7336 850.4001 857.6335 860.0752 866.0149 872.8491 900.6112 926.5267 930.8260 946.8704 978.5920 982.1690 987.1328 987.8688 989.2013 989.9710 992.0776 996.2729 999.9956 1015.4897 1018.6272 1027.4112 1032.1466 1044.3701 1074.3955 1085.6616 1091.7095 1117.7889 1134.1477 1172.4016 1173.4389 1173.5639 1189.8703 1194.5740 1198.0238 1202.3249 1221.0913 1236.3619 1260.7704 1316.9698 1319.8006 1326.3649 1347.7434 1373.0634 1378.6191 1382.4044 1396.1079 1433.3699 1434.7551 1441.4500 1460.2959 1480.9137 1481.4645 1482.4818 1576.2609 1587.4329 1589.2916 1607.1453 1608.1647 1612.0400 1649.7647 3016.5191 3077.6655 3089.5829 3115.9393 3118.8543 3119.3731 3127.7511 3128.5009 3129.5696 3140.9003 3141.3160 3143.7749 3154.8175 3157.7802 3160.2821 3166.2325 3170.8724 3171.6497
redmass: 3.8774 5.4022 3.7576 3.8622 5.1817 5.0511 4.9075 5.1485 6.0890 4.3161 5.1955 4.8460 4.2565 5.0761 4.1452 2.9683 4.8787 6.0798 2.8211 2.8628 2.9309 4.8401 3.3132 3.4684 3.9376 3.4500 5.8184 6.1929 6.3486 6.2629 6.1207 6.1750 4.6814 1.7306 1.7181 1.7849 2.4543 2.3248 1.7402 3.9927 3.0403 5.0386 1.2656 1.2700 1.2885 3.7151 5.0247 1.3718 1.4373 1.4927 1.5141 1.3962 1.3976 1.5172 6.0981 4.3381 5.5807 2.3653 1.3312 1.3527 1.3337 3.8304 2.1879 2.0268 2.4050 2.0808 1.6159 1.6681 2.8278 1.3370 1.0521 1.0608 1.0526 1.1398 1.1280 1.1188 3.1280 1.6774 2.0458 2.4867 1.3591 1.7007 1.3771 1.6825 6.2182 7.9753 9.5129 3.6114 2.2492 2.2238 2.2554 1.1027 2.1891 2.2279 2.2462 5.7250 6.1303 6.0595 5.8740 5.9710 6.0741 8.0520 1.0610 1.1029 1.0883 1.0875 1.0856 1.0859 1.0873 1.0878 1.0872 1.0929 1.0934 1.0930 1.0952 1.0975 1.0977 1.1002 1.0977 1.0985
irintensity: 0.0045 0.3202 0.0186 0.0722 0.1930 0.7523 0.1578 3.8570 4.5691 0.5754 0.8724 0.2116 1.2323 0.3549 1.3762 0.0037 0.8363 2.0287 0.0024 0.2785 0.0923 1.4062 5.7127 21.1483 6.8255 2.3789 4.1855 9.0864 0.4546 3.3553 20.4270 14.9434 12.0721 51.7169 44.8516 69.7050 28.5418 29.3131 40.7316 12.1369 3.9870 24.2468 0.4160 1.9881 0.3262 3.7606 42.2564 5.5117 1.9677 6.5912 10.9379 0.6509 0.5982 3.4533 0.1163 1.6130 0.1479 18.8230 0.1716 3.0595 1.5134 23.0122 6.5880 7.8784 1.0301 30.2929 14.7569 2.5387 102.7930 4.3222 0.2031 2.9122 0.6058 7.3896 16.0269 3.2032 6.6597 6.0457 39.4188 22.0226 1.5982 3.3212 1.6624 12.3782 2.9427 2.4467 4.4073 5.9367 9.9113 11.8619 13.5916 14.1113 35.0286 7.6534 26.8169 0.8112 1.8377 0.2245 3.2319 9.7877 13.1987 23.2702 6.7094 10.3092 13.0332 9.1083 6.0105 5.9107 0.9750 3.0749 0.6456 20.3817 35.2767 30.9496 27.5360 29.3406 23.8868 25.6123 13.3477 32.4989
temp: 298.150 k
press: 1.00000 atm
elementType: 7 7 6 6 6 6 6 6 6 6 6 6 6 6 6 6 6 6 6 6 6 6 6 6 1 1 1 1 1 1 1 1 1 1 1 1 1 1 1 1 1 1
symmnumber: 1
zpe: 875733.2 jmol-1
zpe.correction: 0.333549 hartree
zpe.thermalcorrener: 0.352915 hartree
zpe.thermalcorrenthalpy: 0.353860 hartree
zpe.thermalcorrgfe: 0.281838 hartree
zpe.sumelectzpe: -956.951796 hartree
zpe.sumelectthermal: -956.932430 hartree
zpe.sumelectthermalent: -956.931486 hartree
zpe.sumelectthermalfe: -957.003507 hartree
dipole: 0.1790 0.1886 2.9420
dipole: 2.9535
quadrupole: -118.2549 -135.2062 -133.9087
quadrupole: 3.5906 1.7211 0.0921
quadrupole: 10.8683 -6.0829 -4.7854 3.5906 1.7211 0.0921
hfenergy: -957.2853451 hartree
pointgroup: C01 [X(C22H18N2)]
dipole: 0.0790744 0.1032181 -1.1546822 debye
polarizability: 420.4546261|15.5795977|213.2994113|-2.7004044|4.3203568|195.8441968 unknown
InChI: InChI=1S/C22H18N2/c1-4-10-18(11-5-1)16-21-17-22(24-23-21,19-12-6-2-7-13-19)20-14-8-3-9-15-20/h1-16H,17H2
charge 0 multiplicity 1
42 atoms
N  -0.330343 -0.106442 1.228191
N  0.91306 0.135736 0.960908
C  -1.198924 -0.11331 -0.096055
C  -0.176377 0.321536 -1.196331
C  -1.670811 -1.573591 -0.259047
C  -2.357113 0.869141 0.10204
C  1.154355 0.37039 -0.442432
C  -3.034313 -1.945049 -0.15728
C  -2.8122 1.208374 1.402139
C  -0.705138 -2.592231 -0.483696
C  -3.026779 1.420951 -1.020635
C  2.397959 0.619227 -0.970992
C  -3.424764 -3.29639 -0.29652
C  -3.898132 2.096577 1.572274
C  -1.093303 -3.941058 -0.62054
C  -4.116074 2.304018 -0.850871
C  3.713234 0.697436 -0.322358
C  -2.458737 -4.299903 -0.529789
C  -4.55438 2.64904 0.448698
C  4.843975 0.964464 -1.152533
C  3.928346 0.523493 1.079416
C  6.141957 1.054483 -0.610807
C  5.227227 0.615161 1.615635
C  6.339618 0.879656 0.778725
H  -0.427341 1.319433 -1.596148
H  -0.145908 -0.387679 -2.039587
H  -3.794573 -1.179702 0.026716
H  -2.303432 0.77876 2.269725
H  0.359771 -2.336714 -0.542471
H  -2.707871 1.149772 -2.034295
H  2.416113 0.784703 -2.0589
H  -4.484812 -3.563822 -0.22019
H  -4.231208 2.356483 2.583502
H  -0.332878 -4.711705 -0.789939
H  -4.622088 2.718765 -1.730051
H  -2.763152 -5.347294 -0.634313
H  -5.396796 3.336903 0.582592
H  4.695413 1.101198 -2.231466
H  3.067902 0.319677 1.722145
H  6.995374 1.259881 -1.266373
H  5.376908 0.479829 2.692711
H  7.346838 0.9486 1.204698
