program: Gaussian 09
title: 000282412
version: EM64L-G09RevD.01
frameworkgroup: C1[X(C32H24O)]
method: RPBEPBE
basis: SDD
operation: Freq
keyword: #pfreq=noraman
keyword: PBEPBE/SDD
title: #p freq=noraman PBEPBE/SDD
converged: YES YES NO NO
title: Mulliken charges:
elementType: O C C C C C C C C C C C C C C C C C C C C C C C C C C C C C C C C H H H H H H H H H H H H H H H H H H H H H H H H
charge: -0.166558 -0.028913 0.325780 0.368773 0.309570 -0.071089 0.221865 -0.383270 -0.329130 -0.367659 -0.363052 -0.371511 -0.360165 0.222642 -0.368175 -0.254013 -0.280160 -0.279692 -0.255507 -0.259331 -0.254493 0.294891 -0.396311 -0.246817 -0.246564 -0.256668 -0.258115 -0.244428 -0.394967 -0.418743 -0.235568 -0.250773 -0.245255 0.269730 0.258723 0.279454 0.281724 0.254876 0.257408 0.266779 0.228227 0.225580 0.229697 0.229673 0.222943 0.222814 0.253239 0.230045 0.225817 0.227951 0.233544 0.229619 0.245944 0.285513 0.225487 0.229949 0.228669
chargesum: 0.00000
title: Mulliken charges with hydrogens summed into heavy atoms:
elementType: O C C C C C C C C C C C C C C C C C C C C C C C C C C C C C C C C
charge: -0.166558 -0.028913 0.325780 0.368773 0.309570 -0.071089 0.221865 -0.113540 -0.070407 -0.088204 -0.081328 -0.116635 -0.102756 0.222642 -0.101395 -0.025786 -0.054580 -0.049995 -0.025834 -0.036388 -0.031680 0.294891 -0.143072 -0.016772 -0.020748 -0.028717 -0.024571 -0.014808 -0.149023 -0.133230 -0.010081 -0.020824 -0.016586
polarizability: 3.44672145e+02 -3.44766044e+01 3.70139217e+02 -3.03731097e+01 -1.52917147e+01 2.65179237e+02
1716.lowfreq: -1.3105 -0.0003 -0.0001 0.0006 7.1708 9.4895 22.2663 32.5095 41.7342
frequency: 22.0560 32.4879 41.7095 45.2376 58.5565 62.9738 65.5252 70.6844 82.3943 87.2961 96.4931 110.1771 141.6852 149.5097 163.5920 202.2842 242.3474 251.0334 257.0647 269.4901 284.3689 294.1499 308.3382 311.9036 338.3700 350.1698 384.3295 405.4065 406.9681 408.5852 417.0591 489.6714 499.6660 512.3303 516.7782 537.8237 559.8099 599.9982 611.7519 615.0820 616.3489 617.8370 619.1298 632.5384 648.2296 675.6911 704.2434 707.0594 707.3410 712.0129 714.6119 730.7011 749.5175 751.9906 761.6758 769.0335 775.5453 782.5059 839.6324 855.6584 856.4263 858.7858 866.4050 880.6247 893.6593 905.2237 927.4178 929.1156 944.0340 945.9205 955.9527 979.5080 981.4362 983.7617 986.6137 987.5637 989.3887 990.8238 991.2634 992.2214 993.4800 995.2819 996.4356 998.5733 1001.4749 1002.9073 1030.3178 1032.9321 1034.8277 1035.3028 1054.5427 1080.4450 1090.2699 1091.9851 1093.5050 1111.5436 1136.9103 1168.5917 1172.7304 1173.1953 1173.8612 1174.3543 1177.1700 1188.2466 1195.2365 1202.8428 1203.7250 1205.5450 1211.8204 1265.1160 1288.4693 1320.6629 1323.0521 1328.7506 1331.6052 1355.4306 1370.4013 1371.0579 1375.3720 1377.0147 1418.1707 1429.7200 1433.1750 1436.1802 1436.3905 1464.4779 1480.8147 1482.8348 1485.4674 1495.2721 1568.1736 1578.7147 1583.7293 1584.8831 1587.6527 1590.2377 1600.1802 1604.0046 1607.9901 1611.9748 1612.4128 3121.0981 3121.7788 3121.9588 3124.4892 3126.6957 3129.8478 3132.7761 3132.9217 3133.7725 3137.9590 3142.7649 3147.1346 3148.4419 3150.1616 3150.6708 3152.8289 3157.0286 3158.4349 3162.2493 3164.2495 3165.4927 3166.8128 3167.5040 3172.4741
redmass: 5.5539 5.7524 4.5662 4.4956 4.7941 4.2616 4.8814 4.2992 4.4294 4.7310 4.4519 4.0210 5.7533 6.5174 5.9910 4.8552 4.4354 4.7204 4.5663 5.5464 5.9864 4.7768 4.8275 5.0194 6.9911 5.6186 3.8671 2.8676 2.8926 2.8803 2.9554 4.0787 3.9318 3.7644 4.1188 3.7339 3.7633 5.8522 6.7671 6.2960 6.3172 6.3232 6.4563 5.0929 6.0776 5.9421 2.2355 1.7002 1.8140 2.1525 2.8718 4.3924 2.0636 2.0030 1.8561 2.0207 1.8997 2.2134 3.6422 1.2527 1.2503 1.2551 1.2546 1.5144 4.1580 2.4964 1.4201 1.6317 1.4816 2.0563 1.4223 2.3482 1.6608 1.5387 1.8574 2.4171 1.4522 4.5109 4.2688 5.0318 1.4893 4.8571 1.3843 1.3199 1.4193 1.4716 2.5581 2.2990 2.1976 2.1491 2.0752 1.6679 1.6410 1.6500 1.6575 1.8481 3.0897 2.6980 1.0533 1.0572 1.0548 1.1671 1.0820 3.3082 1.1356 1.1352 1.2083 1.1399 2.7573 1.7262 2.1215 1.4560 1.4256 1.3422 1.3417 7.6046 5.1200 5.6664 7.0544 7.4243 2.1096 2.2518 2.2510 2.2814 2.2946 2.2300 2.0723 2.0993 2.1280 2.7346 6.3392 8.6688 6.0100 6.4252 6.0488 6.4671 6.0818 5.8612 5.9544 5.9995 6.1168 1.0848 1.0845 1.0846 1.0847 1.0853 1.0880 1.0889 1.0892 1.0885 1.0894 1.0931 1.0930 1.0931 1.0944 1.0943 1.0959 1.0953 1.0948 1.0958 1.1012 1.1007 1.0996 1.0993 1.0964
irintensity: 0.0285 0.3918 0.2736 0.0270 0.4087 0.4198 0.8939 0.0545 0.6135 0.3257 0.6946 0.4368 0.6723 1.0220 1.5834 0.2642 0.1333 0.4590 0.0296 0.4944 3.3441 1.0462 0.3665 0.5193 3.6509 0.0859 0.8389 0.1019 0.2078 0.2400 0.1120 0.2901 3.2261 25.4131 2.5380 10.6638 0.7573 5.9079 4.3542 2.8670 0.0424 0.2987 3.2754 31.3483 24.9408 0.1566 92.1979 47.6019 38.0183 17.6750 12.5394 18.9051 113.4340 12.7662 22.1958 27.2432 50.0659 8.4925 14.3623 0.7796 3.8693 1.2447 1.0722 0.6296 4.3771 4.9839 9.1168 2.6962 2.1175 1.8504 2.1628 27.3888 5.3196 7.6570 1.8480 0.2783 0.6869 1.4443 0.8930 1.2784 0.3600 4.9921 0.4242 1.0250 3.9132 3.9718 5.2557 9.9622 10.5251 8.9052 4.6975 7.3527 4.4494 2.6093 9.9280 8.1404 2.5624 0.2095 0.0380 0.5433 0.1201 0.5652 0.0422 12.7821 1.5220 6.7484 10.1593 2.7859 37.5322 13.5499 1.0530 0.7828 1.0352 0.9330 2.0622 1.0001 1.0045 0.1920 1.1074 0.8184 8.6632 8.5901 6.6514 2.9966 16.0956 22.7320 25.0671 28.3085 23.3305 1.9625 1.5924 66.3378 0.5908 10.6845 0.5340 12.3548 4.1160 11.2899 3.1430 1.4277 2.9334 0.0951 0.0310 1.0382 0.2074 1.9541 5.7246 11.6363 9.3868 10.7937 8.0165 18.5909 17.7409 27.5579 27.4293 16.9623 21.3941 18.2178 16.0669 7.6535 24.9328 21.7174 20.7851 22.7237 8.4344
temp: 298.150 k
press: 1.00000 atm
elementType: 8 6 6 6 6 6 6 6 6 6 6 6 6 6 6 6 6 6 6 6 6 6 6 6 6 6 6 6 6 6 6 6 6 1 1 1 1 1 1 1 1 1 1 1 1 1 1 1 1 1 1 1 1 1 1 1 1
symmnumber: 1
zpe: 1189324.9 jmol-1
zpe.correction: 0.452990 hartree
zpe.thermalcorrener: 0.479610 hartree
zpe.thermalcorrenthalpy: 0.480554 hartree
zpe.thermalcorrgfe: 0.395353 hartree
zpe.sumelectzpe: -1306.785272 hartree
zpe.sumelectthermal: -1306.758652 hartree
zpe.sumelectthermalent: -1306.757708 hartree
zpe.sumelectthermalfe: -1306.842909 hartree
dipole: -0.3093 -1.1557 2.4281
dipole: 2.7068
quadrupole: -174.9693 -170.9784 -191.8408
quadrupole: -6.4488 -4.6489 -1.7830
quadrupole: 4.2935 8.2845 -12.5780 -6.4488 -4.6489 -1.7830
hfenergy: -1307.2382619 hartree
pointgroup: C01 [X(C32H24O1)]
dipole: 0.2674168 0.6687301 -0.7844853 debye
polarizability: 304.617565|22.2027139|368.2324466|56.6235898|18.5907689|307.1405866 unknown
InChI: InChI=1S/C32H24O/c33-31(30-24-14-13-23-29(30)25-15-5-1-6-16-25)32(26-17-7-2-8-18-26,27-19-9-3-10-20-27)28-21-11-4-12-22-28/h1-24H
charge 0 multiplicity 1
57 atoms
O  -0.678519 -0.742278 2.276064
C  0.945349 -0.275922 0.468336
C  2.096598 0.500831 1.196463
C  1.264063 -1.796004 0.513645
C  0.741502 0.206627 -0.997978
C  -0.343616 0.030981 1.341497
C  -1.108863 1.326658 1.143123
C  3.109092 1.18917 0.482391
C  0.228957 -2.761291 0.399685
C  0.647808 1.593442 -1.305349
C  2.21208 0.416734 2.610712
C  2.602267 -2.256168 0.575941
C  0.638844 -0.711786 -2.073826
C  -2.265367 1.40847 0.311559
C  -0.658576 2.47281 1.846949
C  4.188289 1.800812 1.160711
C  0.522783 -4.140564 0.363364
C  0.454489 2.039895 -2.628584
C  3.286269 1.030577 3.289515
C  2.900734 -3.637506 0.536399
C  0.449037 -0.267396 -3.402435
C  -2.83192 0.231744 -0.417805
C  -2.903214 2.670095 0.170576
C  4.279465 1.733177 2.568576
C  1.862326 -4.588644 0.433251
C  0.353386 1.110778 -3.69012
C  -1.318193 3.712399 1.70646
C  -2.439767 3.814103 0.852936
C  -3.099219 0.322749 -1.810619
C  -3.17918 -0.966136 0.265194
C  -3.685665 -0.756228 -2.5056
C  -3.773273 -2.042713 -0.430467
C  -4.027436 -1.94415 -1.817995
H  3.06587 1.240724 -0.609289
H  -0.814702 -2.43928 0.337384
H  0.735204 2.337374 -0.508292
H  1.471206 -0.15198 3.182771
H  3.422995 -1.537433 0.661812
H  0.714734 -1.785053 -1.882845
H  0.221076 2.394546 2.493744
H  4.960351 2.322935 0.584111
H  -0.295671 -4.864656 0.280025
H  0.389414 3.115559 -2.828347
H  3.350394 0.951855 4.380625
H  3.945002 -3.966109 0.588691
H  0.377612 -1.005162 -4.209628
H  -3.793992 2.737034 -0.464191
H  5.11452 2.209683 3.094159
H  2.091069 -5.660149 0.408634
H  0.210749 1.456527 -4.720272
H  -0.957429 4.587197 2.258198
H  -2.958716 4.771385 0.732364
H  -2.813096 1.231569 -2.352309
H  -3.006622 -1.04157 1.343916
H  -3.870705 -0.672611 -3.582462
H  -4.046986 -2.952834 0.115318
H  -4.487707 -2.780517 -2.356085
