program: Gaussian 09
title: 000282289
version: EM64L-G09RevD.01
frameworkgroup: C1[X(C11H17N5O6)]
method: RPBEPBE
basis: SDD
operation: Freq
keyword: #p
keyword: freq=noraman
keyword: PBEPBE/SDD
title: #p freq=noraman PBEPBE/SDD
converged: YES YES NO NO
title: Mulliken charges:
elementType: O O O O O O N N N N N C C C C C C C C C C C H H H H H H H H H H H H H H H H H
charge: -0.237318 -0.419248 -0.466429 -0.426024 -0.265390 -0.222964 -0.162112 -0.413713 -0.159370 0.022781 -0.049752 -0.154517 -0.166976 -0.151751 -0.061930 -0.389978 -0.220665 0.231416 0.023076 0.135481 -0.598603 -0.619758 0.277982 0.282480 0.304393 0.246599 0.227534 0.216300 0.351486 0.358851 0.339437 0.346119 0.359444 0.230247 0.273892 0.226966 0.220246 0.255468 0.256298
chargesum: 0.00000
title: Mulliken charges with hydrogens summed into heavy atoms:
elementType: O O O O O O N N N N N C C C C C C C C C C C
charge: -0.237318 -0.067761 -0.107578 -0.079905 -0.265390 -0.222964 -0.162112 -0.054269 -0.159370 0.022781 -0.049752 0.123465 0.115503 0.152641 0.184669 0.053857 0.118772 0.231416 0.023076 0.135481 0.132502 0.112255
polarizability: 2.80182548e+02 -3.97954334e+01 2.01106823e+02 -4.71881992e+00 -9.04990354e+00 1.17159181e+02
1716.lowfreq: -8.3706 -7.7708 -0.0008 -0.0005 0.0005 3.2986 20.6980 25.3486 31.1414
frequency: 20.1492 25.0592 31.1396 51.3527 58.6050 70.7027 74.8226 84.8388 95.1043 121.5186 132.0522 154.9865 167.2853 188.7098 209.9081 222.5762 229.4532 245.8930 268.1510 290.9621 304.1438 336.2772 347.7336 365.0680 369.6301 380.3029 385.6769 406.8327 418.2292 425.0661 444.0324 478.7011 488.8517 526.5112 577.0815 607.4511 636.5340 645.2865 698.3839 724.7280 731.3993 750.6410 779.8187 782.7402 851.5481 864.8161 877.7292 894.9931 930.1305 951.9552 958.4512 967.1196 992.7990 1003.4642 1027.1305 1036.0780 1046.9086 1055.0692 1085.4599 1091.9225 1105.6251 1127.0146 1129.2249 1133.0270 1192.8389 1202.3239 1212.3902 1218.5443 1248.7639 1258.4491 1276.6976 1285.1304 1299.0667 1312.4639 1323.6558 1337.5179 1343.4529 1353.6631 1360.9854 1368.2755 1371.4341 1380.5292 1397.1775 1415.7543 1433.1094 1438.7452 1442.2818 1471.3859 1476.5538 1481.1950 1488.4803 1600.6447 1630.0359 1657.1044 2968.4002 2981.8949 2982.6532 2994.9567 3026.3797 3043.7620 3059.0238 3086.9679 3088.3233 3092.4949 3115.9293 3122.7925 3124.6531 3518.0887 3535.4981 3561.3881 3581.2759
redmass: 6.3151 3.9984 3.6824 8.6853 3.6003 4.7455 1.6093 3.3005 4.6896 2.3363 4.0063 2.1469 4.4615 3.5699 6.0317 2.4353 4.4328 5.3504 2.8081 1.8097 3.5047 2.0350 1.8422 1.2160 4.8485 7.4160 4.3692 4.7647 3.4958 3.5216 5.0172 4.8503 7.0908 5.6597 7.8495 5.8931 5.4546 6.4645 3.0072 7.7516 4.1564 6.3896 5.2313 2.3179 2.2565 4.8360 4.5676 4.9408 3.0741 2.3396 1.6182 4.2354 3.9120 5.6756 3.6876 1.4629 1.9806 2.3489 1.2546 3.1829 1.6796 3.0547 1.6956 1.1731 1.9183 1.4651 2.1912 1.8047 1.9734 1.3294 1.8493 3.6872 1.4773 1.6321 1.9898 3.1842 1.2548 1.2551 1.9391 1.3153 2.0026 2.6090 1.5472 1.1557 1.5182 1.2353 1.0839 1.0463 1.0866 1.0720 1.1270 5.1263 11.0387 6.0675 1.0357 1.0845 1.0338 1.0650 1.0867 1.1019 1.0998 1.0937 1.0950 1.0865 1.1009 1.0959 1.0976 1.0768 1.0662 1.0663 1.0665
irintensity: 0.9931 0.1573 0.1722 0.2853 4.3296 0.7398 0.4697 2.1306 3.3146 1.3429 1.9315 1.6380 9.1191 3.9518 5.0548 7.2298 2.1330 9.9082 66.0473 90.9238 66.3609 65.1829 28.3352 146.8872 3.5170 3.8033 62.0500 7.8991 6.4089 16.8077 3.6174 26.4616 11.4394 16.1983 28.6349 16.2501 11.8680 14.7347 5.5869 2.0299 13.0214 33.0560 16.5817 97.2467 16.0926 24.2914 57.1872 15.5713 30.1512 55.2958 2.2889 187.6044 69.8922 158.4134 66.0410 17.7558 19.1867 121.6239 0.8431 88.0500 2.9469 8.8608 4.6739 39.0391 25.6296 11.3834 38.0461 7.1764 95.7775 9.1625 67.1032 40.9465 19.7642 38.9136 99.0881 276.4482 11.5403 15.0564 62.4617 8.4526 97.6847 99.4915 4.9937 31.6940 82.1243 29.0620 16.3810 12.9777 6.1869 16.5228 52.9542 47.5101 282.5058 684.7271 93.4397 20.3434 57.3664 42.3602 19.7782 36.0425 22.1035 14.7951 22.7677 11.9536 14.3938 93.8898 8.5101 55.5197 14.7879 10.2893 12.9042
temp: 298.150 k
press: 1.00000 atm
elementType: 8 8 8 8 8 8 7 7 7 7 7 6 6 6 6 6 6 6 6 6 6 6 1 1 1 1 1 1 1 1 1 1 1 1 1 1 1 1 1
symmnumber: 1
zpe: 781448.5 jmol-1
zpe.correction: 0.297638 hartree
zpe.thermalcorrener: 0.320576 hartree
zpe.thermalcorrenthalpy: 0.321520 hartree
zpe.thermalcorrgfe: 0.243190 hartree
zpe.sumelectzpe: -1152.710691 hartree
zpe.sumelectthermal: -1152.687753 hartree
zpe.sumelectthermalent: -1152.686809 hartree
zpe.sumelectthermalfe: -1152.765139 hartree
dipole: 1.2355 -6.3793 0.9740
dipole: 6.5704
quadrupole: -123.2156 -133.4239 -126.5444
quadrupole: -14.4243 1.5791 -0.9993
quadrupole: 4.5124 -5.6959 1.1836 -14.4243 1.5791 -0.9993
hfenergy: -1153.0083294 hartree
pointgroup: C01 [X(C11H17N5O6)]
dipole: 0.4585262 2.2236979 -1.2357765 debye
polarizability: 279.7691565|37.8126704|185.1343959|-13.3162371|-35.0295907|133.5449999 unknown
InChI: InChI=1S/C11H17N5O6/c1-15(2)14-13-5-3-16(11(21)12-9(5)20)10-8(19)7(18)6(4-17)22-10/h3,6-8,10,12,17-19H,4H2,1-2H3
charge 0 multiplicity 1
39 atoms
O  -2.729965 0.006368 1.282596
O  -3.978109 -1.089471 -1.375936
O  -1.617484 1.755069 -1.509975
O  -4.067719 3.399794 0.423462
O  -1.190878 -3.197221 1.735583
O  3.266827 -1.99591 1.141292
N  -0.749441 -1.228364 0.496009
N  1.016559 -2.493505 1.417429
N  2.376286 0.516173 -0.425887
N  3.581346 0.643712 0.105557
N  4.342509 1.563058 -0.543107
C  -2.673368 -0.508442 -1.046558
C  -2.765172 1.0495 -0.918674
C  -2.201803 -1.006646 0.345057
C  -2.721236 1.331853 0.603729
C  -3.919439 2.129011 1.142824
C  0.203116 -0.333734 -0.000678
C  -0.366649 -2.369017 1.259772
C  1.567801 -0.469503 0.19309
C  2.072333 -1.653715 0.934365
C  5.696699 1.74988 -0.015527
C  3.864137 2.297378 -1.726226
H  -2.010982 -0.826073 -1.866666
H  -3.709173 1.396169 -1.379227
H  -2.674738 -1.959553 0.629337
H  -1.770768 1.859113 0.827869
H  -3.810792 2.282551 2.23475
H  -4.859017 1.582663 0.958351
H  -4.599144 -0.947391 -0.614389
H  -1.710197 1.782807 -2.494813
H  -0.168286 0.518136 -0.5812
H  -3.252261 3.947792 0.55212
H  1.322273 -3.322039 1.938785
H  6.458664 1.502794 -0.779118
H  5.815052 1.071399 0.842466
H  5.855995 2.793106 0.317575
H  4.670872 2.959154 -2.078539
H  2.96645 2.892912 -1.47787
H  3.575102 1.591396 -2.526726
