program: Gaussian 09
title: 000282391
version: EM64L-G09RevD.01
frameworkgroup: C1[X(C21H22Cl2N4O2S2)]
method: RPBEPBE
basis: SDD
operation: Freq
keyword: #p
keyword: freq=noraman
keyword: PBEPBE/SDD
title: #p freq=noraman PBEPBE/SDD
converged: YES YES NO NO
title: Mulliken charges:
elementType: Cl Cl S S O O N N N N C C C C C C C C C C C C C C C C C C C C C H H H H H H H H H H H H H H H H H H H H H H
charge: -0.058205 -0.059852 0.926289 0.258054 -0.497332 -0.532732 -0.132225 -0.084525 -0.437434 -0.003794 0.484234 -0.419695 -0.418855 -0.592446 0.346883 -0.372633 0.318405 -0.419749 -0.558157 -0.556091 -0.833617 -0.409379 -0.079667 0.269730 -0.183057 -0.235416 -0.346296 -0.358931 -0.133823 -0.483591 -0.154718 0.279202 0.240291 0.241798 0.277353 0.226944 0.228250 0.276199 0.266864 0.292353 0.268197 0.291686 0.233964 0.240301 0.231333 0.237592 0.283502 0.286589 0.252533 0.262710 0.311247 0.271531 0.258186
chargesum: 0.00000
title: Mulliken charges with hydrogens summed into heavy atoms:
elementType: Cl Cl S S O O N N N N C C C C C C C C C C C C C C C C C C C C C
charge: -0.058205 -0.059852 0.926289 0.258054 -0.497332 -0.532732 -0.132225 -0.084525 -0.126187 -0.003794 0.484234 0.099799 0.100296 -0.365502 0.346883 -0.144383 0.318405 -0.143551 0.001059 0.003792 -0.128020 -0.171787 -0.079667 0.269730 0.100445 0.051173 -0.093763 -0.096221 -0.133823 -0.212059 0.103468
polarizability: 7.78282612e+02 1.69396811e+01 3.53008055e+02 -1.14693632e+01 -2.17238983e+01 2.06890025e+02
1716.lowfreq: -10.7959 -2.9149 -2.1528 -0.0025 -0.0013 -0.0010 3.1528 13.7740 15.2850
frequency: -7.2102 13.7209 15.2615 23.2321 29.6326 32.8558 38.8345 42.0762 57.9304 61.9638 75.2453 79.7151 91.0247 94.1859 120.8603 123.5477 129.2050 147.8575 151.9276 159.8601 179.6237 185.0961 186.4202 199.1895 234.2033 250.2887 269.7900 284.2339 294.5531 313.3359 351.4154 352.4363 377.5175 379.7167 390.4603 399.9292 410.4772 425.0035 444.2557 463.0439 472.2200 497.7480 501.4847 514.8038 531.1343 533.6249 546.0482 553.9116 590.0366 598.8016 602.0445 608.3456 617.0131 621.9515 638.1983 679.1217 706.3887 720.7022 729.6774 741.2874 776.2203 784.9821 812.5532 814.7931 822.3028 825.7833 839.4969 841.5814 852.3236 861.9216 870.8935 871.2196 919.5520 925.8806 943.4837 948.8348 951.1016 968.9340 977.5778 984.2758 990.5042 996.7394 1001.8169 1007.6795 1039.8573 1041.8898 1045.9977 1052.6212 1074.5761 1105.1973 1111.9506 1161.5994 1168.2668 1171.7275 1176.9897 1196.8397 1201.0142 1215.8634 1238.2320 1259.4103 1263.1993 1276.5243 1288.3391 1295.8309 1297.5484 1302.0847 1305.1050 1347.7671 1352.9710 1356.6649 1369.7374 1381.3075 1398.0147 1404.5627 1410.1954 1426.4210 1438.7062 1441.2107 1446.3703 1462.9211 1470.8892 1473.0724 1484.5213 1490.1836 1495.6713 1519.6354 1548.0140 1564.4791 1569.4433 1601.4698 1630.9105 2976.4159 2982.1791 2984.1455 2986.2844 3056.1827 3057.3352 3058.9476 3077.3006 3084.0234 3085.6669 3143.9166 3144.8968 3145.3759 3146.7036 3150.9178 3155.9077 3169.8129 3170.9351 3175.6438 3198.1374 3245.9768 3416.8983
redmass: 7.8908 9.0432 9.6368 5.9807 8.3733 10.1978 5.9060 8.6871 5.6102 6.7579 6.9816 6.6338 6.3806 4.8779 4.7287 5.9620 5.6535 2.8490 1.6745 5.1554 4.6969 7.3745 4.2812 2.9968 4.5529 4.4156 5.9794 4.2297 6.4984 6.0742 4.2465 7.1698 3.4306 4.2361 3.2370 5.9455 2.9588 4.8881 3.4677 3.4941 3.4088 4.4135 3.8226 3.4236 4.9395 3.5292 3.2170 3.7406 6.4019 3.3791 4.5889 3.9330 6.8425 4.7949 5.9003 5.1512 2.4682 3.3051 1.6752 3.0235 2.1767 4.2779 5.8979 1.5466 2.1030 1.8492 1.7543 5.0607 1.5501 2.7441 1.3454 1.8181 1.9390 2.5644 9.0112 1.4496 2.1882 1.6343 1.3553 3.1469 1.5456 1.6348 3.1962 1.8561 2.3988 1.6827 2.5069 1.6216 1.2600 2.4929 1.3043 1.2250 1.4520 1.4698 1.6140 1.4055 2.2840 1.2661 1.4030 1.5010 2.4996 1.6474 1.3038 1.4222 2.2945 1.3813 1.2117 1.4836 1.7498 1.8300 4.2301 1.8119 1.3599 2.1083 3.8619 5.0947 1.1955 1.1368 1.8480 1.8998 1.2849 1.0469 1.3810 5.9797 1.2314 2.5215 7.1165 6.2040 6.8801 6.0061 6.5329 1.0683 1.0543 1.0681 1.0685 1.0579 1.0582 1.0976 1.0939 1.0933 1.0985 1.1088 1.1001 1.0889 1.0976 1.0909 1.0884 1.0951 1.0961 1.0975 1.0918 1.1003 1.0767
irintensity: 0.0642 0.0710 0.1626 0.7195 0.3403 0.6726 0.7687 0.8959 0.4026 0.9153 2.9210 1.0005 4.5288 4.1140 3.0052 4.6832 0.7864 2.0716 5.2851 16.5324 0.1794 3.4003 1.4374 1.0215 5.8104 14.0018 20.8142 27.9588 7.9823 3.6534 1.1031 12.1475 5.5611 11.6284 37.1900 66.4985 0.3187 70.2457 43.0520 78.8031 6.5261 11.5345 38.0766 69.3972 11.6551 42.2650 10.7469 8.4946 5.9730 9.5839 11.0553 27.9803 1.4971 25.2752 42.4845 6.2852 66.9813 3.7171 29.6777 4.0152 154.1758 11.4233 150.5391 7.3748 58.6079 48.5038 25.0765 5.3504 28.3538 59.7595 1.7935 0.4667 123.1296 1.5316 46.4795 3.1490 14.8462 72.2825 5.7088 0.7646 21.6722 1.3475 142.4384 4.1927 8.4684 12.3375 101.1236 2.0660 8.7442 149.6271 10.9239 22.1462 46.4138 104.8449 22.3543 2.9193 48.5892 27.5520 254.8364 3.4955 31.6929 6.3298 13.0514 79.3247 2.4294 81.8294 39.5950 196.9896 304.0548 20.3328 1.3390 135.6536 40.6902 7.0032 17.1469 41.2458 12.9249 5.8500 8.7801 13.7008 27.8790 12.4618 13.2911 21.1877 8.3021 357.4524 183.0745 782.3883 597.2891 219.4060 277.1509 3.3181 44.9839 35.3384 37.9282 19.3382 14.2535 14.2727 1.5232 6.3536 25.6692 31.3516 29.2588 5.0809 3.8217 19.4198 1.5998 29.6108 1.8787 9.6179 10.1223 1.1705 35.4858
temp: 298.150 k
press: 1.00000 atm
elementType: 17 17 16 16 8 8 7 7 7 7 6 6 6 6 6 6 6 6 6 6 6 6 6 6 6 6 6 6 6 6 6 1 1 1 1 1 1 1 1 1 1 1 1 1 1 1 1 1 1 1 1 1 1
symmnumber: 1
zpe: 1031565.8 jmol-1
zpe.correction: 0.392903 hartree
zpe.thermalcorrener: 0.423965 hartree
zpe.thermalcorrenthalpy: 0.424909 hartree
zpe.thermalcorrgfe: 0.325288 hartree
zpe.sumelectzpe: -2896.676533 hartree
zpe.sumelectthermal: -2896.645471 hartree
zpe.sumelectthermalent: -2896.644527 hartree
zpe.sumelectthermalfe: -2896.744148 hartree
dipole: -6.6363 4.3422 -2.7756
dipole: 8.4023
quadrupole: -223.6921 -193.1776 -226.4422
quadrupole: 23.8509 -18.4228 -4.4802
quadrupole: -9.2548 21.2596 -12.0049 23.8509 -18.4228 -4.4802
hfenergy: -2897.069436 hartree
pointgroup: C01 [X(C21H22Cl2N4O2S2)]
dipole: -2.5175092 -2.064542 0.5723535 debye
polarizability: 778.7768584|2.4142446|353.2708045|15.6155016|17.8748344|206.1330284 unknown
InChI: InChI=1S/C21H22Cl2N4O2S2/c1-16-14-19(27(11-8-22)12-9-23)5-2-17(16)15-25-18-3-6-20(7-4-18)31(28,29)26-21-24-10-13-30-21/h2-7,10,13-15,26H,8-9,11-12H2,1H3
charge 0 multiplicity 1
53 atoms
Cl -8.201061 -1.817823 -2.566347
Cl -8.674837 0.68207 2.238419
S  5.794253 1.964936 -0.151786
S  8.809058 -1.027026 0.835381
O  6.332771 1.50693 -1.616463
O  6.164972 3.413365 0.499622
N  -6.531404 -0.408716 -0.052871
N  -0.216342 1.229693 0.146026
N  6.496374 0.633646 1.243565
N  6.252831 -1.450623 0.078928
C  -5.137052 -0.29882 0.028223
C  -7.206625 -1.710355 0.079577
C  -7.378567 0.775872 -0.273823
C  -4.308321 -1.444302 0.261614
C  -2.905218 -1.360853 0.348115
C  -4.477982 0.967938 -0.119469
C  -2.266015 -0.086972 0.186791
C  -3.086452 1.055451 -0.044019
C  -7.15916 -2.58347 -1.18258
C  -7.619468 1.626884 0.980846
C  -2.109107 -2.63148 0.608729
C  -0.814211 0.058445 0.246054
C  3.951523 1.705007 -0.055022
C  1.186402 1.339744 0.079765
C  3.393658 0.620929 -0.754896
C  3.195898 2.619801 0.702475
C  1.99922 0.444885 -0.685025
C  1.802611 2.438853 0.748795
C  6.983039 -0.541772 0.72937
C  8.357518 -2.532253 -0.010894
C  7.005879 -2.53807 -0.339717
H  -8.256043 -1.532366 0.365386
H  -6.759675 -2.287058 0.914195
H  -6.926949 1.426953 -1.048823
H  -8.344228 0.441804 -0.687265
H  -4.760422 -2.432557 0.38635
H  -5.050144 1.882254 -0.296421
H  -2.584233 2.021492 -0.160625
H  -7.602478 -3.575139 -1.001995
H  -6.147911 -2.674723 -1.603311
H  -8.194093 2.536403 0.746183
H  -6.69147 1.874953 1.515083
H  -1.40861 -2.855458 -0.217493
H  -1.50923 -2.555618 1.534538
H  -2.780269 -3.499703 0.718738
H  -0.223076 -0.865679 0.404705
H  4.029354 -0.057957 -1.33095
H  3.686252 3.454355 1.213122
H  1.528587 -0.368995 -1.246862
H  1.165357 3.133126 1.304003
H  7.168777 1.211735 1.777428
H  9.094332 -3.314496 -0.180695
H  6.50768 -3.348843 -0.872772
