program: Gaussian 09
title: 000282258
version: EM64L-G09RevD.01
frameworkgroup: C1[X(C11H18N2O)]
method: RPBEPBE
basis: SDD
operation: Freq
keyword: #p
keyword: freq=noraman
keyword: PBEPBE/SDD
title: #p freq=noraman PBEPBE/SDD
converged: YES YES NO NO
title: Mulliken charges:
elementType: O N N C C C C C C C C C C C H H H H H H H H H H H H H H H H H H
charge: -0.276328 -0.077042 -0.319103 -0.142446 -0.155397 -0.515610 -0.114682 -0.129917 -0.451291 -0.450777 -0.438562 -0.477468 -0.652841 0.104173 0.217113 0.228438 0.279038 0.211834 0.214259 0.225484 0.218438 0.210001 0.210098 0.220258 0.210932 0.226817 0.241461 0.223943 0.195452 0.225866 0.221692 0.316168
chargesum: 0.00000
title: Mulliken charges with hydrogens summed into heavy atoms:
elementType: O N N C C C C C C C C C C C
charge: -0.276328 -0.077042 -0.002935 0.074666 0.073041 -0.024737 0.099577 0.095567 -0.022852 -0.020422 -0.000813 -0.012064 -0.009831 0.104173
polarizability: 1.30306334e+02 4.66847837e+00 1.20272437e+02 1.92158809e+00 4.14584102e+00 1.20168034e+02
1716.lowfreq: -0.0003 -0.0002 0.0008 14.8951 18.1810 23.6355 66.1345 126.6235 139.2534
frequency: 65.9295 126.6126 139.2511 195.6833 220.1221 240.3240 266.6122 271.0028 295.4881 333.4212 383.2701 400.2095 429.3612 465.5361 494.3132 524.4730 536.5207 648.2090 667.4544 699.9208 728.9177 734.1848 761.7454 773.0558 831.3525 843.3254 872.1381 883.7528 893.8410 922.3772 942.4524 962.0917 968.3215 1003.5158 1032.6867 1039.8105 1059.6559 1075.8841 1086.3589 1113.4670 1119.5117 1127.4905 1151.2400 1164.4549 1179.3588 1190.9668 1211.5951 1218.6546 1235.7777 1254.4736 1266.4264 1280.5781 1289.9017 1303.5195 1307.1872 1321.9628 1330.4548 1339.7437 1343.2937 1353.7982 1371.7219 1398.3739 1419.2667 1430.1620 1441.5956 1454.0365 1464.0486 1470.1471 1480.7297 1499.1956 1500.4339 1598.7930 2862.7429 2934.2544 2949.1951 2952.8426 2978.1285 2990.0966 2997.6898 2998.5365 3004.1992 3018.9971 3023.4898 3035.7150 3055.0898 3058.1695 3060.8515 3078.5502 3126.7065 3499.9637
redmass: 5.2568 3.1455 3.0816 3.0998 1.2550 1.6468 2.6457 2.2852 4.5304 2.8315 3.2793 3.3722 2.8435 3.6610 2.2003 2.4925 4.1642 3.6523 1.5674 4.1902 4.3941 3.6485 3.2715 1.3834 3.4954 2.9786 2.4422 2.4556 2.7269 2.1182 2.1738 2.0387 2.0457 2.2084 1.6109 2.0237 2.4613 1.7049 1.3725 1.4405 1.8423 1.3262 1.6114 2.2015 1.6078 1.3868 1.2660 1.6317 1.3631 1.5799 1.3907 1.3520 1.6560 1.4739 1.5905 1.4092 1.8747 1.6519 1.3782 1.5237 1.4520 1.6406 1.8275 1.1435 1.0768 1.0831 1.1047 1.1037 1.1323 1.0592 1.0950 3.9232 1.0567 1.0741 1.0778 1.0811 1.0685 1.0621 1.0719 1.0717 1.0656 1.0907 1.0873 1.0870 1.1011 1.1001 1.0933 1.1036 1.0917 1.0751
irintensity: 2.8317 0.4412 0.8551 1.9916 0.4255 0.5931 1.0558 0.8102 2.5309 1.6411 7.1552 0.8899 0.2830 5.2867 8.2140 2.6219 7.5547 33.2954 83.3642 3.8720 1.9442 0.6890 6.9000 1.4512 7.3386 8.6478 4.5682 0.7588 1.6603 2.3357 15.0409 3.0276 1.0451 12.4886 15.7039 6.0720 18.9453 1.2500 7.1185 2.2047 9.2139 2.8680 3.3335 21.3130 24.5608 0.5012 6.7912 3.4297 2.1411 23.7783 21.0298 2.0338 2.5766 4.6343 6.0019 2.3401 6.6618 0.2373 25.3985 31.4945 27.2011 44.0646 12.7744 21.1438 17.4074 3.7211 10.9564 11.8666 30.1173 4.4074 15.5713 266.8391 116.3898 10.9905 96.5704 49.8586 32.7117 17.1357 51.7395 32.6860 61.7193 5.0284 126.3240 35.4350 0.1356 33.4812 8.6750 66.7368 13.9022 16.4180
temp: 298.150 k
press: 1.00000 atm
elementType: 8 7 7 6 6 6 6 6 6 6 6 6 6 6 1 1 1 1 1 1 1 1 1 1 1 1 1 1 1 1 1 1
symmnumber: 1
zpe: 736162.5 jmol-1
zpe.correction: 0.280389 hartree
zpe.thermalcorrener: 0.292304 hartree
zpe.thermalcorrenthalpy: 0.293248 hartree
zpe.thermalcorrgfe: 0.243458 hartree
zpe.sumelectzpe: -613.590796 hartree
zpe.sumelectthermal: -613.578881 hartree
zpe.sumelectthermalent: -613.577937 hartree
zpe.sumelectthermalfe: -613.627727 hartree
dipole: 2.7382 2.8622 1.2834
dipole: 4.1638
quadrupole: -100.4075 -85.2249 -77.2727
quadrupole: -9.5341 -3.1291 -0.0413
quadrupole: -12.7724 2.4101 10.3623 -9.5341 -3.1291 -0.0413
hfenergy: -613.871185 hartree
pointgroup: C01 [X(C11H18N2O1)]
dipole: -1.075454 -1.1541287 0.4415556 debye
polarizability: 130.2723418|4.9672089|120.6350555|-1.4328676|-4.0168839|119.8394071 unknown
InChI: InChI=1S/C11H18N2O/c1-13-9-5-11(14)12-6-10(13)8-3-2-7(9)4-8/h7-10,12H,2-6H2,1H3
charge 0 multiplicity 1
32 atoms
O  3.154232 1.366414 -0.085446
N  -0.55987 -1.20575 -0.542652
N  1.912259 -0.111457 1.153114
C  -1.325389 0.270449 1.292732
C  -0.959361 1.218333 -0.850123
C  -0.70716 1.538875 0.646043
C  -0.522266 -1.015753 0.923749
C  -0.126584 -0.017241 -1.31263
C  -2.721778 0.22821 0.591853
C  -2.477489 0.85103 -0.830663
C  0.907316 -1.127731 1.53907
C  1.419285 0.203588 -1.333703
C  -0.111108 -2.50778 -1.047386
C  2.195796 0.527231 -0.049825
H  -1.405028 0.341297 2.393664
H  -0.734724 2.07108 -1.516307
H  0.339298 1.7321 0.913185
H  -1.295116 2.430395 0.939206
H  -1.073365 -1.874144 1.368407
H  -0.4074 -0.214208 -2.369834
H  -3.449005 0.829539 1.169311
H  -3.110976 -0.802276 0.520908
H  -2.731533 0.1357 -1.631919
H  -3.089017 1.761052 -0.977083
H  0.807696 -1.071273 2.640439
H  1.292784 -2.144757 1.309636
H  1.663979 1.028466 -2.026225
H  1.887979 -0.706384 -1.764178
H  0.984881 -2.709746 -0.955667
H  -0.370329 -2.591838 -2.119518
H  -0.641602 -3.314333 -0.506918
H  2.557994 0.182612 1.89306
