program: Gaussian 09
title: 000282261
version: EM64L-G09RevD.01
frameworkgroup: C1[X(C11H20N2O)]
method: RPBEPBE
basis: SDD
operation: Freq
keyword: #p
keyword: freq=noraman
keyword: PBEPBE/SDD
title: #p freq=noraman PBEPBE/SDD
converged: YES YES NO NO
title: Mulliken charges:
elementType: O N N C C C C C C C C C C C H H H H H H H H H H H H H H H H H H H H
charge: -0.262639 -0.099710 -0.316773 0.016356 -0.464341 -0.374595 -0.461687 -0.406505 -0.467630 -0.627943 -0.635374 -0.114069 0.083330 -0.286518 0.173464 0.222637 0.225776 0.221656 0.199412 0.244672 0.238176 0.198193 0.204286 0.208346 0.226230 0.305964 0.188542 0.218425 0.235039 0.240818 0.218983 0.192783 0.219761 0.234934
chargesum: 0.00000
title: Mulliken charges with hydrogens summed into heavy atoms:
elementType: O N N C C C C C C C C C C C
charge: -0.262639 -0.099710 -0.010809 0.189820 -0.015928 0.046474 0.021162 -0.004027 -0.033053 0.014063 0.017210 0.105692 0.083330 -0.051584
polarizability: 1.53293737e+02 3.52904795e+00 1.36541436e+02 -1.32006676e+00 1.61948097e+00 1.09049114e+02
1716.lowfreq: -10.0482 -8.0343 -0.0005 -0.0002 0.0003 7.9943 46.2498 61.6981 81.7680
frequency: 46.1711 61.4976 81.6254 125.3397 147.9811 167.5798 193.5162 223.4808 230.8683 254.9201 281.0622 289.3256 311.9014 327.0132 354.3106 387.0599 422.9067 444.0918 456.0556 485.0383 547.4356 575.2911 613.3078 658.9133 714.7029 724.6736 744.7860 776.0433 800.1238 832.3560 849.6614 901.8336 927.2832 946.2836 974.5844 999.2429 1012.4483 1029.9011 1062.5211 1072.9751 1073.7025 1090.9586 1102.9444 1116.1821 1132.4914 1160.6433 1162.0734 1198.9309 1218.6828 1234.8213 1244.1859 1254.2621 1281.9895 1293.9027 1298.4661 1306.6701 1327.6725 1337.6576 1342.0299 1359.2047 1367.7371 1388.3319 1418.9979 1427.3560 1448.2304 1460.3828 1462.5366 1464.6562 1471.8229 1480.4727 1481.1888 1485.7139 1491.3845 1504.5373 1594.4723 1658.8125 2776.2462 2849.3131 2864.6976 2966.2302 2987.5776 2995.0008 3002.7605 3012.8648 3019.1951 3035.6879 3037.9883 3039.9719 3052.8908 3057.3198 3078.9731 3084.6257 3090.3967 3095.4391 3114.5214 3501.6143
redmass: 6.3052 2.9056 3.3191 3.3995 3.2085 3.3886 1.7843 2.1517 1.6062 1.6196 2.1881 2.2312 2.4554 3.2111 2.5460 2.3834 2.4863 2.3096 2.3705 2.1862 3.3511 2.4308 2.9120 1.5272 2.4637 1.4795 2.1440 2.8625 1.9271 3.6139 2.5659 2.1305 2.2027 1.8268 1.2971 2.1522 1.9249 1.5781 2.0300 1.9939 2.1265 1.4837 2.4483 2.2953 1.5039 1.2653 1.3296 1.9109 1.4192 1.9228 1.2603 1.6099 1.4441 1.1680 1.7416 1.2978 1.2603 1.4336 1.4359 1.3833 1.3860 1.7020 1.1851 1.8730 1.1682 1.0938 1.0839 1.0615 1.0567 1.0866 1.0667 1.0804 1.0602 1.0727 4.9137 7.7508 1.0797 1.0573 1.0576 1.0597 1.0634 1.0642 1.0640 1.0626 1.1003 1.0727 1.0725 1.0946 1.0965 1.1001 1.0855 1.0993 1.0999 1.0993 1.0964 1.0752
irintensity: 2.4425 1.0429 0.9745 0.1675 1.4852 0.2376 0.9448 0.3550 0.6182 0.3037 3.8930 1.9099 0.9971 6.6945 3.7153 0.9042 6.0483 0.4279 8.2197 2.6396 11.6727 5.3819 15.4291 78.7064 46.3847 10.9627 19.6276 19.6743 10.3976 3.4335 13.5254 8.3362 7.6594 5.7760 0.1535 13.6874 3.4608 18.2696 9.2394 20.7986 2.2831 5.5417 2.2534 6.2277 6.0148 7.8096 15.4309 15.6132 7.0366 16.3650 1.6832 9.5194 4.3345 1.0178 95.3610 0.6182 2.5829 5.0548 8.8381 8.9832 1.6542 68.8307 2.0687 28.8689 8.7344 10.2681 5.5962 8.7090 4.1553 10.8127 6.7772 14.2017 52.1391 9.9646 350.9740 11.6924 94.5646 73.5401 195.1025 38.0724 41.3869 26.8401 35.7557 27.2344 22.2071 25.8360 48.9503 35.9445 26.1648 53.8992 26.9388 22.3357 30.2603 35.2178 23.5143 13.1036
temp: 298.150 k
press: 1.00000 atm
elementType: 8 7 7 6 6 6 6 6 6 6 6 6 6 6 1 1 1 1 1 1 1 1 1 1 1 1 1 1 1 1 1 1 1 1
symmnumber: 1
zpe: 782737.8 jmol-1
zpe.correction: 0.298129 hartree
zpe.thermalcorrener: 0.312837 hartree
zpe.thermalcorrenthalpy: 0.313781 hartree
zpe.thermalcorrgfe: 0.257231 hartree
zpe.sumelectzpe: -614.735385 hartree
zpe.sumelectthermal: -614.720677 hartree
zpe.sumelectthermalent: -614.719733 hartree
zpe.sumelectthermalfe: -614.776283 hartree
dipole: -4.5002 1.2867 1.0138
dipole: 4.7891
quadrupole: -96.1156 -84.9292 -85.5059
quadrupole: 11.5927 7.8499 -3.1720
quadrupole: -7.2654 3.9210 3.3444 11.5927 7.8499 -3.1720
hfenergy: -615.0335137 hartree
pointgroup: C01 [X(C11H20N2O1)]
dipole: 1.7888385 0.4242744 -0.4124539 debye
polarizability: 152.9159375|-4.2907307|136.8909127|-1.6963643|-1.5831191|109.0774366 unknown
InChI: InChI=1S/C11H20N2O/c1-13(2)10-7-5-3-4-6-8-11(14)12-9-10/h6,8,10,12H,3-5,7,9H2,1-2H3
charge 0 multiplicity 1
34 atoms
O  -2.907774 -1.704163 0.984516
N  2.729902 -0.14351 -0.30877
N  -0.658257 -1.756087 0.441855
C  1.515299 -0.455687 0.501582
C  0.774904 0.828175 0.966108
C  0.407547 1.814879 -0.17393
C  0.55128 -1.385718 -0.307494
C  -0.89048 2.621809 0.081639
C  -2.175011 1.74013 0.187745
C  3.452886 -1.342607 -0.795905
C  3.665058 0.764725 0.395807
C  -2.366741 0.842844 -1.016213
C  -1.966263 -1.347874 0.206736
C  -2.220823 -0.509128 -1.026452
H  1.812678 -1.023119 1.430075
H  1.373402 1.346783 1.738706
H  -0.139783 0.488455 1.485116
H  0.298741 1.261542 -1.124351
H  1.244228 2.520401 -0.341444
H  0.2491 -0.875675 -1.236853
H  1.077917 -2.314152 -0.591771
H  -1.022382 3.352424 -0.742186
H  -0.797236 3.213459 1.015062
H  -3.05105 2.411621 0.287121
H  -2.147249 1.128954 1.107645
H  -0.54693 -2.36049 1.26283
H  3.736347 -2.05214 0.02366
H  4.381313 -1.019159 -1.298101
H  2.857194 -1.893897 -1.541706
H  3.188543 1.73754 0.596739
H  4.541058 0.951283 -0.250011
H  4.034785 0.350376 1.368317
H  -2.609464 1.345624 -1.96524
H  -2.368943 -1.072121 -1.958634
