program: Gaussian 09
title: 000282246
version: EM64L-G09RevD.01
frameworkgroup: C1[X(C5H6Br2O3S)]
method: RPBEPBE
basis: SDD
operation: Freq
keyword: #p
keyword: freq=noraman
keyword: PBEPBE/SDD
title: #p freq=noraman PBEPBE/SDD
converged: YES YES NO NO
title: Mulliken charges:
elementType: Br Br S O O O C C C C C H H H H H H
charge: 0.104245 0.104245 0.950269 -0.522725 -0.554232 -0.096580 -0.572308 -0.572307 -0.595254 -0.595254 0.377677 0.304655 0.330402 0.330403 0.304654 0.351055 0.351056
chargesum: 0.00000
title: Mulliken charges with hydrogens summed into heavy atoms:
elementType: Br Br S O O O C C C C C
charge: 0.104245 0.104245 0.950269 -0.522725 -0.554232 -0.096580 0.062749 0.062750 -0.244199 -0.244199 0.377677
polarizability: 1.54568467e+02 1.16337789e-03 1.41496944e+02 3.53827315e-03 -1.62650633e-01 7.90136571e+01
1716.lowfreq: -10.2869 -8.4425 -1.0188 -0.0009 0.0005 0.0008 48.6944 68.0092 81.7287
frequency: 48.6411 67.9885 81.7276 108.4600 137.7990 181.4587 184.4503 211.7587 235.4698 252.5730 282.3300 303.1852 336.1100 382.2741 513.0167 542.0257 578.2869 644.9713 679.1644 742.4076 758.2679 791.9858 865.7352 927.2368 970.1693 980.8254 1044.4000 1066.8515 1070.6989 1118.8348 1162.6818 1188.3819 1223.3316 1235.0221 1288.6976 1305.8134 1417.9584 1421.5581 1668.6242 3042.3250 3050.2609 3061.2364 3063.5195 3158.2812 3160.5066
redmass: 15.6282 5.4343 9.3759 20.6504 19.3273 12.4828 5.2531 12.6916 8.3872 2.5904 6.7307 8.0145 3.7442 13.3791 6.2311 8.7437 4.6696 5.3492 4.7729 4.5153 2.9223 11.8366 1.5768 7.1739 3.1934 2.2906 3.7726 4.0209 1.0823 1.2058 1.1600 1.1682 1.2693 1.2048 1.3880 1.2795 1.0992 1.0965 11.1894 1.0840 1.0839 1.0559 1.0567 1.1116 1.1129
irintensity: 2.1105 2.5565 11.5259 3.4556 1.7301 0.8883 6.2346 0.9032 0.9453 2.6653 14.1557 50.5140 15.1792 20.2119 0.5774 8.9043 15.9961 48.9073 0.1344 14.1523 19.9807 83.8487 19.2778 52.6938 0.0080 21.6819 21.2356 10.0063 1.4561 11.8040 0.7055 18.0009 0.0575 6.1012 2.3097 6.0063 5.1188 11.9492 70.2201 1.4370 3.3239 1.6224 1.5025 0.2919 1.3462
temp: 298.150 k
press: 1.00000 atm
elementType: 35 35 16 8 8 8 6 6 6 6 6 1 1 1 1 1 1
symmnumber: 1
zpe: 278474.5 jmol-1
zpe.correction: 0.106065 hartree
zpe.thermalcorrener: 0.118474 hartree
zpe.thermalcorrenthalpy: 0.119418 hartree
zpe.thermalcorrgfe: 0.064787 hartree
zpe.sumelectzpe: -843.750588 hartree
zpe.sumelectthermal: -843.738179 hartree
zpe.sumelectthermalent: -843.737235 hartree
zpe.sumelectthermalfe: -843.791867 hartree
dipole: 0.0000 -0.9892 -0.4948
dipole: 1.1060
quadrupole: -86.1566 -116.7757 -94.0643
quadrupole: -0.0001 -0.0002 -4.7355
quadrupole: 12.8422 -17.7768 4.9346 -0.0001 -0.0002 -4.7355
hfenergy: -843.8566534 hartree
pointgroup: C01 [X(C5H6Br2O3S1)]
dipole: -0.3956756 -0.0000409 -0.1810753 debye
dipolederiv: -0.3304975 0.3560201 0.046771 0.2659222 -0.4621004 -0.0116136 0.0599748 -0.0274391 -0.0384659 -0.3304454 -0.356022 0.0469484 -0.2658863 -0.462115 0.0118557 0.0601097 0.0275413 -0.038495 1.4232626 0.0000051 0.0466768 0.0000286 1.3559202 -0.0000489 0.1190345 0.0000366 1.1357196 -0.7996312 -0.0000246 0.0557985 0.0000339 -0.5823782 0.0000153 0.2532321 0.0000269 -0.5462992 -0.5918197 0.0000197 0.0226904 -0.0000558 -0.5897058 -0.0000099 -0.2178942 -0.0000683 -0.6386915 -0.5877657 0.0000451 -0.1419616 -0.0000607 -0.341809 0.0000059 -0.2213861 0.0000253 -0.2842915 -0.0914977 0.0403629 -0.0090585 -0.0736436 -0.070184 -0.0156352 -0.0641217 -0.0287936 -0.0562629 -0.0914891 -0.0403678 -0.0090512 0.0735389 -0.0702845 0.0156347 -0.064106 0.0287349 -0.0562987 0.2849956 -0.4886048 -0.0731602 -0.3018009 0.271592 -0.0308766 -0.1676848 0.0541846 0.0251184 0.2849968 0.4887141 -0.0734163 0.3017652 0.2717376 0.0307101 -0.1676621 -0.0544673 0.025098 0.5928783 -0.0000475 0.3042967 0.0000073 0.5183459 -0.0000516 0.3437551 -0.0000575 0.2027896 0.0309817 0.0490822 -0.0348319 0.0346664 0.057128 0.0085148 0.0182658 -0.0273422 0.002146 0.03028 0.0047575 -0.0148116 -0.0342239 0.0321903 0.0004018 -0.0002944 -0.0003545 0.0882429 0.0302392 -0.0047949 -0.0147951 0.0342774 0.0322185 -0.0003851 -0.0003438 0.0003629 0.0882494 0.0309848 -0.0491125 -0.0348082 -0.0346247 0.0571607 -0.0085436 0.0182335 0.0273619 0.0021459 0.0572614 0.0284149 -0.0586574 0.0290938 -0.0088119 0.0736789 0.0154957 0.0169193 0.0446054 0.0572657 -0.0284477 -0.0586298 -0.0290378 -0.0089046 -0.0736528 0.0153918 -0.0166712 0.0446895 unknown
polarizability: 141.4106311|-0.0022681|154.5684611|-2.3263896|-0.0220027|79.0999758 unknown
InChI: InChI=1S/C5H6Br2O3S/c6-3-1-11(9,10)2-4(7)5(3)8/h3-4H,1-2H2
charge 0 multiplicity 1
17 atoms
Br -1.737392 2.934614 0.147509
Br -1.737215 -2.934843 0.148945
S  1.89593 -0.000055 -0.032383
O  3.154112 -0.000255 -1.065424
O  2.081665 0.000325 1.596699
O  -2.469892 -0.000308 -0.561345
C  0.682036 1.495372 -0.428273
C  0.682109 -1.495728 -0.427585
C  -0.591007 1.290412 0.392768
C  -0.590926 -1.290453 0.393384
C  -1.363184 -0.000138 0.002499
H  0.535876 1.468469 -1.519041
H  1.255794 2.379973 -0.114814
H  1.255916 -2.380158 -0.113734
H  0.535933 -1.469324 -1.518364
H  -0.34343 1.272693 1.46988
H  -0.343324 -1.272197 1.470481
