program: Gaussian 09
title: 000282256
version: EM64L-G09RevD.01
frameworkgroup: C1[X(C8H15NO4S2)]
method: RPBEPBE
basis: SDD
operation: Freq
keyword: #p
keyword: freq=noraman
keyword: PBEPBE/SDD
title: #p freq=noraman PBEPBE/SDD
converged: YES YES NO NO
title: Mulliken charges:
elementType: S S O O O O N C C C C C C C C H H H H H H H H H H H H H H H
charge: 0.955453 0.981746 -0.552673 -0.527744 -0.552962 -0.532057 -0.120681 -0.496208 -0.176677 0.008527 -0.627008 -0.608624 -0.586016 -0.617238 -0.652086 0.358763 0.341760 0.245386 0.296694 0.291656 0.295364 0.292239 0.301515 0.294078 0.237042 0.198790 0.238601 0.239995 0.177622 0.294743
chargesum: 0.00000
title: Mulliken charges with hydrogens summed into heavy atoms:
elementType: S S O O O O N C C C C C C C C
charge: 0.955453 0.981746 -0.552673 -0.527744 -0.552962 -0.532057 -0.120681 -0.137445 0.165083 0.253913 -0.038659 -0.021021 0.009577 0.057195 0.060275
polarizability: 1.77744462e+02 -1.95208788e+00 1.61009548e+02 3.79114133e+00 1.86273964e+00 1.28540609e+02
1716.lowfreq: -8.4298 -3.9721 -0.0030 -0.0025 -0.0023 13.5048 36.2061 52.0937 68.1043
frequency: 36.0350 52.0081 68.0604 80.8892 110.2560 130.9590 154.0078 160.9751 199.1445 217.6322 226.2762 237.0706 241.2852 254.9823 266.2129 272.0591 323.2858 328.8584 340.1174 369.5779 388.5335 453.5405 469.2515 486.6262 515.1894 541.8884 599.3394 634.4531 708.3663 763.5670 781.2776 794.0596 810.7374 839.7324 870.2442 895.1726 921.0235 935.5932 954.9916 973.4634 987.3261 1013.9194 1040.6929 1042.1115 1052.5606 1058.7471 1081.2502 1093.0449 1096.6563 1134.8020 1164.8638 1173.1346 1190.5331 1214.7618 1217.1919 1236.1754 1272.2185 1273.7355 1325.8308 1381.0865 1393.9279 1413.5783 1427.1382 1431.5411 1455.3137 1466.6143 1475.3296 1489.1074 1497.0158 2839.0417 2853.7773 2878.8072 2971.4045 3028.4546 3034.3584 3064.5760 3065.7366 3068.2562 3077.1172 3084.6453 3092.1342 3170.5624 3176.2158 3179.7241
redmass: 6.7995 4.7462 7.0143 3.6776 5.0263 7.8960 8.2166 5.5217 4.5351 2.6613 2.6300 2.6720 3.4602 3.0899 2.0835 4.3246 3.2930 1.5246 3.0180 2.4536 5.3474 5.3705 3.5479 2.5750 3.4123 8.6421 6.2236 3.9566 4.0277 2.3248 1.4053 4.5868 8.6523 2.8668 2.6671 3.9628 2.6004 2.3260 1.5112 2.3920 3.0829 1.8228 1.4654 1.6751 1.9793 1.6030 1.2299 1.3795 1.4781 1.4155 1.2751 1.3286 2.0142 2.4682 1.4317 1.4550 2.2775 1.3202 1.3638 1.3701 1.1476 1.0995 1.1272 1.1202 1.1559 1.0574 1.0514 1.0466 1.0532 1.0774 1.0597 1.0560 1.0830 1.0747 1.0746 1.0557 1.0550 1.0576 1.0889 1.1011 1.1006 1.1144 1.1143 1.1119
irintensity: 6.5820 1.8761 11.0959 1.2241 0.3026 1.9803 10.2855 3.4921 1.6035 2.1225 2.5146 0.3569 6.0288 10.1193 6.6045 28.3515 5.0881 8.8773 5.0847 0.7029 15.5775 12.7785 2.1580 4.9774 5.8852 42.9609 36.1950 0.8890 4.7871 7.0916 3.3891 21.1674 94.8105 10.1670 27.3952 67.1062 20.1246 44.9265 3.7421 11.1114 77.5939 10.9174 1.2376 14.9134 21.7031 7.5331 0.6811 12.7207 1.7408 4.8756 10.9706 0.3918 17.5648 4.2644 15.7788 1.9931 2.7836 3.6543 30.6285 2.7183 16.8323 20.6323 0.7363 11.9555 9.2282 19.2393 10.8876 18.6239 19.2647 38.7682 95.8006 139.7870 20.7796 20.0297 30.7722 1.0036 0.8422 7.8713 2.6632 5.6653 34.3734 0.4733 0.1626 0.2230
temp: 298.150 k
press: 1.00000 atm
elementType: 16 16 8 8 8 8 7 6 6 6 6 6 6 6 6 1 1 1 1 1 1 1 1 1 1 1 1 1 1 1
symmnumber: 1
zpe: 598681.7 jmol-1
zpe.correction: 0.228026 hartree
zpe.thermalcorrener: 0.245357 hartree
zpe.thermalcorrenthalpy: 0.246301 hartree
zpe.thermalcorrgfe: 0.183040 hartree
zpe.sumelectzpe: -1464.041127 hartree
zpe.sumelectthermal: -1464.023795 hartree
zpe.sumelectthermalent: -1464.022851 hartree
zpe.sumelectthermalfe: -1464.086112 hartree
dipole: 3.4228 4.2649 -4.5157
dipole: 7.0920
quadrupole: -125.9927 -112.2586 -112.3171
quadrupole: 18.6957 1.4626 -3.2161
quadrupole: -9.1366 4.5975 4.5390 18.6957 1.4626 -3.2161
hfenergy: -1464.2691526 hartree
pointgroup: C01 [X(C8H15N1O4S2)]
dipole: -1.5590601 -1.2353353 -1.9566823 debye
polarizability: 173.8960088|-6.7756727|164.2201747|4.4602337|-5.3103775|129.1784359 unknown
InChI: InChI=1S/C8H15NO4S2/c1-9(2)7-5-15(12,13)8(7)6-3-14(10,11)4-6/h6-8H,3-5H2,1-2H3
charge 0 multiplicity 1
30 atoms
S  -1.109141 2.182819 -0.082767
S  2.585772 -1.064785 0.860903
O  -0.349699 2.888288 -1.35809
O  -1.432424 3.022578 1.273569
O  1.626165 -1.638054 2.05955
O  4.159028 -1.460901 0.787183
N  -2.251315 -1.339077 0.14009
C  -0.345398 0.334758 0.140616
C  1.029948 0.33628 -0.518474
C  -1.585234 -0.255141 -0.61213
C  -2.525108 0.993003 -0.708755
C  1.583032 -1.072557 -0.867726
C  2.125648 0.835728 0.464304
C  -3.474925 -1.816188 -0.547078
C  -1.37007 -2.470624 0.511035
H  -0.35148 0.111819 1.220543
H  0.993935 0.987763 -1.416509
H  -1.273856 -0.566681 -1.642845
H  -2.873191 1.313428 -1.699736
H  -3.302032 1.001267 0.069393
H  2.360249 -1.067911 -1.647224
H  0.888754 -1.916709 -0.954944
H  1.812861 1.392024 1.358935
H  3.017978 1.260365 -0.018821
H  -4.172774 -0.980549 -0.72863
H  -3.260729 -2.308372 -1.528111
H  -3.987912 -2.549101 0.098555
H  -1.939639 -3.164789 1.152825
H  -1.010934 -3.054475 -0.374888
H  -0.496207 -2.1299 1.092925
