program: Gaussian 09
title: 000282292
version: EM64L-G09RevD.01
frameworkgroup: C1[X(C15H20N2O6S)]
method: RPBEPBE
basis: SDD
operation: Freq
keyword: #p
keyword: freq=noraman
keyword: PBEPBE/SDD
title: #p freq=noraman PBEPBE/SDD
converged: NO YES NO NO
title: Mulliken charges:
elementType: S O O O O O O N N C C C C C C C C C C C C C C C H H H H H H H H H H H H H H H H H H H H
charge: 0.988203 -0.324108 -0.274294 -0.265404 -0.512739 -0.487258 -0.260771 -0.293208 0.096093 -0.136668 -0.126849 -0.015851 0.357244 -0.334274 -0.431719 -0.702983 -0.697263 -0.032461 -0.217242 -0.267205 -0.408848 -0.332338 0.454744 -0.798336 0.250368 0.243517 0.270536 0.250529 0.206404 0.283485 0.279606 0.224161 0.231871 0.229972 0.215078 0.260794 0.249112 0.329121 0.293877 0.248145 0.247234 0.241406 0.229744 0.238573
chargesum: 0.00000
title: Mulliken charges with hydrogens summed into heavy atoms:
elementType: S O O O O O O N N C C C C C C C C C C C C C C C
charge: 0.988203 -0.324108 -0.274294 -0.265404 -0.512739 -0.487258 -0.260771 -0.293208 0.096093 0.113700 0.116669 0.254685 0.357244 0.122659 0.131372 -0.016979 0.027721 -0.032461 0.111879 0.026672 -0.160703 -0.085104 0.454744 -0.088613
polarizability: 2.69089834e+02 1.31190196e+01 2.17073238e+02 -5.25972730e+00 4.64429524e-01 1.87039195e+02
1716.lowfreq: -49.7750 -9.0206 -0.0020 -0.0015 -0.0003 3.4665 9.6035 18.6723 31.3097
frequency: -49.7281 18.0646 31.2607 43.1649 47.3612 51.9431 78.0980 94.0021 105.4419 115.5020 135.2540 139.7360 155.1324 188.5617 191.4965 200.6884 216.1621 223.4403 244.2748 277.7704 279.3912 282.2967 289.4759 312.2049 334.4744 342.4465 379.7714 382.5348 396.8413 400.7106 407.9469 415.8815 452.9220 478.4827 504.6664 533.8932 558.0275 584.0169 609.7229 619.5032 683.3069 701.1386 715.8915 723.6839 770.8729 775.4780 786.2491 811.1712 829.4764 835.1225 839.8938 846.8163 857.0847 894.3553 912.0062 930.3676 943.6481 957.6976 971.3824 975.7358 983.6495 985.6152 994.2046 994.3631 998.0048 1032.9026 1049.4049 1049.9774 1057.4936 1064.5321 1105.0962 1125.9920 1133.8403 1151.5879 1184.1696 1193.3924 1197.8061 1205.2167 1218.3578 1243.1688 1247.3503 1259.2097 1281.8657 1294.7495 1307.7907 1310.3986 1321.8718 1326.2428 1345.2668 1352.4861 1381.2500 1381.4755 1394.0470 1395.1496 1401.8948 1426.5164 1451.9311 1454.3475 1459.6770 1469.6858 1473.0045 1473.9561 1474.8634 1494.7942 1589.9181 1593.5771 2960.0366 2983.8443 2986.1025 2991.9618 3003.9773 3005.0813 3054.2947 3063.2132 3070.0752 3078.9548 3094.2593 3094.7781 3101.7427 3107.9125 3108.5305 3114.8522 3124.0017 3138.7177 3146.5264 3168.8497
redmass: 1.0257 4.8185 6.5056 6.5275 5.2161 4.5009 4.4725 5.5253 4.9921 4.2448 7.5577 5.9564 6.6648 3.0779 1.4319 5.8690 2.8389 6.7977 8.8076 2.8735 3.7363 1.1848 5.2912 4.3075 2.7598 5.5464 3.6802 3.1268 4.2620 3.3132 3.0204 9.7405 8.2147 3.7225 3.3259 4.8805 3.7240 6.1457 3.9749 6.8688 5.0128 3.4031 3.3607 8.1232 5.0514 4.6774 4.4300 5.9509 3.9875 1.7473 3.5472 4.9469 1.2479 2.5102 3.1542 1.6821 2.4510 10.8096 2.0345 1.3758 2.9929 3.5747 1.7120 1.3460 1.4438 3.2854 2.2756 1.6693 2.9048 3.6358 5.7047 1.3109 2.1762 2.3149 1.5196 1.1327 1.3985 2.6267 3.1663 1.2543 1.3390 3.2642 1.9112 2.5424 1.2554 1.2077 1.2978 1.2356 1.3954 1.2921 1.2934 5.3360 2.2659 1.2277 1.4082 1.0781 1.0762 1.0563 1.0552 1.0459 1.0671 2.0553 1.1497 1.0481 6.0267 6.6322 1.0685 1.0376 1.0836 1.0355 1.0353 1.0579 1.0873 1.0973 1.0897 1.1017 1.0991 1.1002 1.1011 1.0990 1.0969 1.1011 1.0922 1.0898 1.0954 1.0959
irintensity: 0.5232 0.7332 2.1398 0.9341 0.6695 0.5910 0.8433 0.9288 0.4108 2.5311 5.5055 3.8650 2.0641 3.6274 1.9507 5.4189 1.5126 10.8044 1.9660 4.3747 2.8368 1.3162 13.7088 6.9847 0.7109 3.4455 0.8525 1.0252 38.9401 5.1702 1.0841 42.5064 70.8184 12.7254 89.6380 3.2464 0.3350 27.7747 4.9937 0.7052 24.7695 0.8815 45.4660 1.1492 16.9819 0.1741 28.2572 80.2318 98.0143 38.4685 56.0372 8.3310 0.4740 8.7072 10.3472 1.6560 7.1620 66.0418 40.3429 9.7551 0.0351 38.0668 7.8930 0.2618 3.1255 66.6362 18.4703 13.4570 56.7719 85.4237 73.7407 3.0191 40.0330 24.9606 24.2265 13.0305 1.7191 71.9452 4.5034 3.6275 8.3821 55.1575 7.4639 38.5841 0.8025 2.1706 0.8861 11.2737 3.3362 10.9651 38.3037 6.8273 13.7693 33.1133 16.6691 27.9373 7.8832 2.9838 7.4311 14.3913 1.5334 27.0635 17.0344 15.3598 12.2893 5.0088 73.1828 21.8136 13.9754 11.6210 10.4884 7.9762 8.6906 13.9406 49.4111 0.3120 14.3942 7.7198 3.1180 16.3622 25.6070 20.8565 62.3017 8.3186 18.2455 7.8254
temp: 298.150 k
press: 1.00000 atm
elementType: 16 8 8 8 8 8 8 7 7 6 6 6 6 6 6 6 6 6 6 6 6 6 6 6 1 1 1 1 1 1 1 1 1 1 1 1 1 1 1 1 1 1 1 1
symmnumber: 1
zpe: 882926.3 jmol-1
zpe.correction: 0.336289 hartree
zpe.thermalcorrener: 0.360156 hartree
zpe.thermalcorrenthalpy: 0.361101 hartree
zpe.thermalcorrgfe: 0.281996 hartree
zpe.sumelectzpe: -1540.415400 hartree
zpe.sumelectthermal: -1540.391532 hartree
zpe.sumelectthermalent: -1540.390588 hartree
zpe.sumelectthermalfe: -1540.469693 hartree
dipole: 1.5013 5.7284 -2.5854
dipole: 6.4617
quadrupole: -125.0830 -158.0252 -155.9449
quadrupole: 11.2449 -1.7062 -3.4613
quadrupole: 21.2680 -11.6742 -9.5939 11.2449 -1.7062 -3.4613
hfenergy: -1540.7516888 hartree
pointgroup: C01 [X(C15H20N2O6S1)]
dipole: 1.3896389 1.7340552 1.2348383 debye
polarizability: 225.8783909|-21.7046361|253.3595409|-13.1732637|19.8777266|193.9643342 unknown
InChI: InChI=1S/C15H20N2O6S/c1-10-4-6-11(7-5-10)24(19,20)17(16-18)8-12-14-13(9-21-12)22-15(2,3)23-14/h4-7,12-14H,8-9H2,1-3H3
charge 0 multiplicity 1
44 atoms
S  -1.893424 0.342222 -1.117355
O  1.770029 -0.056132 -0.363042
O  3.966598 -0.860055 -0.575261
O  1.793933 -3.291925 -0.626759
O  -0.846087 0.338698 -2.354945
O  -3.473995 0.124985 -1.38699
O  -1.608376 -2.301476 1.859804
N  -1.227535 -1.138155 0.003447
N  -1.922486 -1.244919 1.180049
C  1.854455 -1.187776 0.568168
C  3.322216 -1.734171 0.417758
C  0.953983 -2.403913 0.217778
C  2.925873 -0.098659 -1.313466
C  3.146825 -3.200713 -0.03939
C  -0.322658 -2.135814 -0.599119
C  3.430872 1.330022 -1.502168
C  2.530483 -0.792525 -2.622454
C  -1.665578 1.824059 0.01497
C  -0.364674 2.268359 0.29186
C  -2.834387 2.43114 0.502202
C  -0.242681 3.412395 1.113207
C  -2.675224 3.571949 1.315509
C  -1.384703 4.078249 1.631738
C  -1.240085 5.303492 2.514501
H  1.625208 -0.790901 1.570354
H  3.924374 -1.651892 1.337286
H  0.695449 -2.931941 1.158339
H  3.872371 -3.488771 -0.814881
H  3.225305 -3.887573 0.830167
H  -0.867328 -3.090642 -0.724983
H  -0.045835 -1.738168 -1.591552
H  2.670929 1.935072 -2.02573
H  3.653775 1.783438 -0.522735
H  4.352265 1.323014 -2.108487
H  3.376813 -0.761308 -3.330764
H  2.255274 -1.845171 -2.443079
H  1.667355 -0.26821 -3.068992
H  0.513196 1.731953 -0.087475
H  -3.819927 2.027448 0.250865
H  0.757962 3.787903 1.354444
H  -3.565584 4.073003 1.712238
H  -1.641905 5.112506 3.527185
H  -0.185474 5.606884 2.622021
H  -1.800498 6.162018 2.100739
