program: Gaussian 09
title: 000282241
version: EM64L-G09RevD.01
frameworkgroup: C1[X(C9H16O3S)]
method: RPBEPBE
basis: SDD
operation: Freq
keyword: #p
keyword: freq=noraman
keyword: PBEPBE/SDD
title: #p freq=noraman PBEPBE/SDD
converged: NO YES NO NO
title: Mulliken charges:
elementType: S O O O C C C C C C C C C H H H H H H H H H H H H H H H H
charge: 0.921624 -0.547872 -0.546980 -0.225717 -0.411381 -0.371045 -0.404390 -0.617800 -0.392126 -0.399183 -0.697351 -0.508354 0.283705 0.240380 0.217886 0.251007 0.217994 0.207441 0.229111 0.307156 0.303097 0.203103 0.204333 0.201595 0.237456 0.307326 0.291641 0.251646 0.245697
chargesum: 0.00000
title: Mulliken charges with hydrogens summed into heavy atoms:
elementType: S O O O C C C C C C C C C
charge: 0.921624 -0.547872 -0.546980 -0.225717 0.046886 0.097955 0.032163 -0.007547 0.015310 0.039868 -0.098384 -0.011011 0.283705
polarizability: 1.52561167e+02 -3.76536668e+00 1.30841522e+02 1.56055712e+00 -2.20497615e+00 1.11743098e+02
1716.lowfreq: -7.2366 -0.0020 -0.0013 0.0012 7.1624 10.6678 42.1485 91.2876 106.2530
frequency: 41.9156 91.2689 106.1507 136.2055 164.1976 173.6193 181.5164 224.3470 235.6621 239.4144 254.5550 287.9707 302.2747 314.3937 336.9534 388.3187 412.8343 451.1673 472.7599 510.9325 576.5920 579.5545 731.6458 749.0157 758.2068 793.8599 824.7395 848.8713 865.6128 896.2205 902.7442 920.4900 934.3741 989.0422 1002.2273 1044.8484 1059.1252 1069.4983 1094.7789 1118.3237 1128.0024 1147.9522 1160.3151 1181.8972 1186.6537 1209.9011 1244.6339 1259.2751 1266.1390 1298.3761 1314.0816 1334.7755 1349.5469 1351.5836 1361.0729 1363.5433 1409.7323 1427.5303 1433.2738 1438.7622 1459.2303 1471.2196 1486.8461 1498.5113 1583.7839 2948.5397 2965.3390 2966.4386 2981.8881 2990.2964 2997.5944 3007.6560 3025.0653 3036.8899 3041.7529 3048.9347 3051.6358 3061.3223 3068.5596 3131.6749 3169.8676
redmass: 5.0723 6.4363 2.9277 5.2122 4.0578 4.2686 6.5425 3.0387 3.2937 3.4308 2.3907 2.4746 3.8182 3.1578 2.3631 3.1984 3.1575 2.9644 3.2288 2.6487 3.4321 3.2574 1.2831 2.2899 2.0046 10.7559 2.2404 1.7699 1.9641 2.1461 2.5567 2.0851 3.4210 2.0616 1.9867 1.4497 1.7001 1.7835 2.0702 2.2422 1.2720 1.2049 1.4456 1.6212 1.2820 1.3043 1.2510 1.2642 1.2180 1.1246 1.2300 1.5718 1.4354 1.4504 1.4165 1.3656 1.1420 1.1061 1.0969 1.0833 1.0836 1.0798 1.0753 1.0903 6.8094 1.0651 1.0620 1.0657 1.0658 1.0650 1.0675 1.0910 1.0963 1.0946 1.0647 1.0874 1.0996 1.0549 1.0976 1.1101 1.1132
irintensity: 6.2381 6.1751 1.0113 2.7453 0.6971 5.9257 1.5832 8.1927 0.3380 8.2966 1.6976 9.6707 1.5067 5.8512 1.6365 15.5180 13.1144 42.9305 25.8660 1.0736 11.9873 5.1130 19.0542 1.4556 2.6781 64.1203 8.3164 16.5465 5.8240 8.1453 22.2697 19.2051 33.0442 13.8414 2.2934 12.9120 23.2790 0.3266 7.3417 2.6629 8.2516 13.7895 37.3554 57.2602 22.6046 5.8267 3.9661 4.8688 16.9701 0.8764 3.0023 29.2243 7.2871 9.8437 3.8814 0.9020 24.1597 49.8878 11.5745 14.4518 19.5601 9.9518 7.7233 25.2568 67.0006 18.2289 32.5562 13.8179 24.8903 27.1159 21.3316 13.9671 61.3789 14.5656 5.1455 9.0948 38.1012 0.6670 32.7999 0.0732 0.4071
temp: 298.150 k
press: 1.00000 atm
elementType: 16 8 8 8 6 6 6 6 6 6 6 6 6 1 1 1 1 1 1 1 1 1 1 1 1 1 1 1 1
symmnumber: 1
zpe: 627718.4 jmol-1
zpe.correction: 0.239085 hartree
zpe.thermalcorrener: 0.253310 hartree
zpe.thermalcorrenthalpy: 0.254254 hartree
zpe.thermalcorrgfe: 0.198848 hartree
zpe.sumelectzpe: -975.074224 hartree
zpe.sumelectthermal: -975.059999 hartree
zpe.sumelectthermalent: -975.059055 hartree
zpe.sumelectthermalfe: -975.114462 hartree
dipole: 4.2140 0.3999 -0.5190
dipole: 4.2646
quadrupole: -102.0804 -77.7539 -94.3675
quadrupole: -1.0898 7.4911 -8.0804
quadrupole: -10.6798 13.6467 -2.9669 -1.0898 7.4911 -8.0804
hfenergy: -975.3133095 hartree
pointgroup: C01 [X(C9H16O3S1)]
dipole: 1.6209653 0.1649508 -0.4004134 debye
polarizability: 152.6052052|-3.6560435|130.1759153|-2.5544054|-3.4759783|112.3646662 unknown
InChI: InChI=1S/C9H16O3S/c10-9-6-4-2-1-3-5-7-13(11,12)8-9/h1-8H2
charge 0 multiplicity 1
29 atoms
S  -1.98263 -0.029926 0.61231
O  -3.537877 -0.435413 0.326643
O  -1.559394 0.619734 2.05436
O  0.581595 -1.524064 -1.358456
C  0.763406 2.004089 0.3185
C  -0.600491 2.335749 -0.336025
C  1.86569 1.48138 -0.640591
C  -1.384801 1.140441 -0.872651
C  3.013335 0.751275 0.118363
C  2.886316 -0.794384 0.230172
C  -0.947519 -1.763834 0.468549
C  1.589276 -1.341933 0.874902
C  0.431359 -1.538683 -0.099632
H  0.587551 1.292877 1.144341
H  1.135529 2.925432 0.807591
H  -1.228528 2.889503 0.386188
H  -0.440622 3.011513 -1.203789
H  2.28282 2.342968 -1.198545
H  1.448328 0.798777 -1.404465
H  -2.361387 1.396252 -1.314542
H  -0.817224 0.46413 -1.531608
H  3.104945 1.189108 1.134093
H  3.977212 0.954344 -0.388588
H  3.751506 -1.162873 0.81444
H  2.971384 -1.235418 -0.781392
H  -1.597385 -2.330953 -0.212942
H  -0.989224 -2.102325 1.514708
H  1.243595 -0.727377 1.730943
H  1.786632 -2.346692 1.31132
