program: Gaussian 09
title: 000282254
version: EM64L-G09RevD.01
frameworkgroup: C1[X(C13H20N2O2S)]
method: RPBEPBE
basis: SDD
operation: Freq
keyword: #p
keyword: freq=noraman
keyword: PBEPBE/SDD
title: #p freq=noraman PBEPBE/SDD
converged: YES YES NO NO
title: Mulliken charges:
elementType: S O O N N C C C C C C C C C C C C C H H H H H H H H H H H H H H H H H H H H
charge: 0.981828 -0.562806 -0.581819 -0.255194 -0.181673 -0.742595 0.488144 -0.384171 -0.605008 -0.606549 0.428286 -0.661641 -0.654559 -0.401220 -0.351274 -0.237490 -0.241454 -0.245348 0.259175 0.264903 0.219854 0.196739 0.277718 0.247219 0.273104 0.195693 0.248629 0.264113 0.266010 0.212682 0.226630 0.221604 0.257933 0.233116 0.265191 0.227966 0.226294 0.229971
chargesum: 0.00000
title: Mulliken charges with hydrogens summed into heavy atoms:
elementType: S O O N N C C C C C C C C C C C C C
charge: 0.981828 -0.562806 -0.581819 -0.255194 -0.181673 -0.218517 0.488144 -0.164317 0.116668 0.110877 0.428286 0.081164 0.051608 -0.168105 -0.086083 -0.009524 -0.015160 -0.015377
polarizability: 4.57400062e+02 1.34022766e+01 1.98048225e+02 -6.23333085e+00 -1.82882632e+00 1.22523757e+02
1716.lowfreq: -7.7543 -5.7976 -0.0021 -0.0017 -0.0009 6.0014 10.1218 27.6656 39.5274
frequency: 7.8506 27.4499 39.4943 47.8735 54.1417 71.9618 94.7819 110.1132 126.3643 150.0163 162.2338 172.6180 196.6397 205.5217 218.0875 226.6352 234.9042 253.5652 280.1018 283.5058 304.0486 328.0355 357.6994 363.3441 376.6326 408.2007 416.0954 424.1100 466.6073 504.7602 534.0508 612.7627 631.3809 671.0861 696.2034 726.0147 759.1557 802.8625 809.5698 833.1150 857.4075 859.2804 865.1371 927.7990 941.5587 980.8223 982.9443 990.4241 997.2447 1020.8759 1025.2545 1051.5027 1061.3647 1074.9637 1085.3913 1090.4340 1095.5066 1102.9297 1133.4610 1171.4107 1179.7309 1182.5873 1190.4693 1208.3952 1209.0336 1258.5783 1283.0557 1332.3946 1379.1994 1405.1636 1410.5169 1416.1400 1423.4541 1433.1783 1441.3279 1457.6546 1458.9863 1461.2299 1472.0959 1473.8413 1474.3859 1477.4403 1477.6775 1486.7146 1509.3918 1565.4093 1579.9305 1603.2353 2901.9481 2906.0933 2941.6307 2961.1719 3024.1983 3025.3749 3038.3549 3042.7512 3080.1564 3086.3411 3087.6336 3089.6115 3119.7628 3122.2130 3127.8189 3130.4962 3142.1899 3158.7627 3169.4874 3186.5028
redmass: 4.7574 4.2679 3.3230 3.4367 4.1116 4.4491 3.7522 4.7176 1.5221 4.7820 2.6053 2.5782 5.1401 4.9980 1.0497 1.3714 1.4831 1.9251 3.2672 3.4580 3.4503 3.3051 3.5815 3.9753 2.7232 2.8791 2.6879 8.1036 5.3105 2.9269 3.9862 6.2807 4.1911 5.7532 1.7994 3.8985 1.6476 10.3908 2.1568 1.5246 1.3353 4.1624 2.7354 1.4736 6.0525 2.1691 1.9329 3.2429 1.3373 1.3698 2.1264 1.4626 1.2645 1.2296 1.5747 1.2304 1.2535 1.3248 1.3811 1.0761 2.0087 5.8316 1.1216 2.1778 2.2660 2.7793 1.9026 1.3727 4.9797 1.1283 1.5650 1.1569 1.1815 1.5923 1.5372 1.0450 1.1765 1.0534 1.0476 1.1513 1.0589 1.9250 1.1597 1.0862 1.1976 5.1658 5.3275 5.8839 1.0479 1.0471 1.0414 1.0388 1.0858 1.0847 1.1001 1.0925 1.1006 1.0973 1.0986 1.0568 1.0868 1.0873 1.0875 1.0959 1.0932 1.0964 1.0988 1.1136
irintensity: 2.4993 0.8580 1.0651 1.1517 1.4504 2.8965 2.6148 12.1035 7.1611 2.9647 19.9653 11.6857 2.1793 2.9796 0.5805 5.9761 3.9415 3.3964 19.2198 31.3182 14.4505 11.0066 7.2248 4.1487 0.7637 0.4307 6.6446 30.0227 78.4824 15.7901 2.5465 0.2827 11.1985 6.8502 49.3594 1.3317 50.7812 40.7820 5.8707 41.7117 13.6304 75.3171 12.8441 9.9845 52.4737 3.8551 4.8918 14.6755 0.2518 1.3815 10.9463 21.8498 6.6029 0.0948 6.6947 40.5963 63.0571 4.5893 20.1237 1.8173 32.3928 17.0353 1.3756 42.8837 9.7781 1.5565 14.1202 9.6341 7.0316 21.7222 8.4782 3.9308 17.5359 28.4338 10.7476 22.6537 8.9605 9.5054 10.1557 19.9579 79.3322 21.3760 18.1661 4.8833 41.5606 28.7182 86.2792 4.4628 73.6321 178.5122 75.6778 52.9139 5.5849 43.4038 23.0671 16.2078 23.3605 2.4719 4.1488 12.1531 0.8827 13.4549 0.6830 8.7804 24.7346 36.1057 29.9878 1.7719
temp: 298.150 k
press: 1.00000 atm
elementType: 16 8 8 7 7 6 6 6 6 6 6 6 6 6 6 6 6 6 1 1 1 1 1 1 1 1 1 1 1 1 1 1 1 1 1 1 1 1
symmnumber: 1
zpe: 806875.4 jmol-1
zpe.correction: 0.307323 hartree
zpe.thermalcorrener: 0.328648 hartree
zpe.thermalcorrenthalpy: 0.329592 hartree
zpe.thermalcorrgfe: 0.254587 hartree
zpe.sumelectzpe: -1163.801732 hartree
zpe.sumelectthermal: -1163.780407 hartree
zpe.sumelectthermalent: -1163.779463 hartree
zpe.sumelectthermalfe: -1163.854468 hartree
dipole: -0.1573 1.2705 -5.0750
dipole: 5.2340
quadrupole: -99.5992 -108.2415 -124.7841
quadrupole: -1.9553 -18.1226 2.0619
quadrupole: 11.2758 2.6334 -13.9092 -1.9553 -18.1226 2.0619
hfenergy: -1164.1090549 hartree
pointgroup: C01 [X(C13H20N2O2S1)]
dipole: 0.0988545 0.374441 2.0224593 debye
polarizability: 456.2529646|-20.0118173|198.4474042|-11.2565111|6.8999292|123.271676 unknown
InChI: InChI=1S/C11H14N.C2H6NO2S/c1-10(12(2)3)9-11-7-5-4-6-8-11;1-3(2)6(4)5/h4-9H,1H2,2-3H3;1-2H3
charge 0 multiplicity 1
38 atoms
S  -2.701391 -0.103915 -0.526796
O  -2.204803 -1.41996 -1.348842
O  -2.766224 1.360389 -1.252355
N  -4.52557 -0.482779 -0.077495
N  0.238044 1.824036 0.243795
C  -1.32686 0.121667 1.150587
C  -0.015095 0.484274 0.597268
C  0.895062 -0.568448 0.415004
C  -4.687342 -1.832311 0.496211
C  -5.157649 0.632432 0.652437
C  2.329759 -0.547708 0.154898
C  0.738226 2.127071 -1.118647
C  -0.586516 2.906333 0.816006
C  2.971855 -1.7842 -0.175625
C  3.155899 0.614003 0.294664
C  4.363252 -1.857257 -0.373403
C  4.550313 0.530933 0.117898
C  5.164014 -0.698331 -0.226939
H  -1.883736 0.888494 1.703407
H  -1.396697 -0.882028 1.588662
H  0.459818 -1.571594 0.506693
H  -4.469092 -1.896101 1.587103
H  -4.039395 -2.532195 -0.058541
H  -5.737159 -2.142434 0.335817
H  -4.83718 1.583108 0.193007
H  -4.943119 0.645155 1.746301
H  -6.252443 0.545509 0.518759
H  -0.109747 2.407412 -1.775772
H  1.233409 1.247271 -1.552365
H  1.467338 2.958958 -1.093063
H  -0.078483 3.868217 0.625859
H  -0.677579 2.792968 1.910698
H  -1.596264 2.950744 0.355589
H  2.358253 -2.687466 -0.282251
H  2.692792 1.564597 0.57446
H  4.826575 -2.814494 -0.637248
H  5.165396 1.429103 0.245733
H  6.247844 -0.752453 -0.37752
