program: Gaussian 09
title: 000282344
version: EM64L-G09RevD.01
frameworkgroup: C1[X(C20H22ClFN6O3S2)]
method: RPBEPBE
basis: SDD
operation: Freq
keyword: #p
keyword: freq=noraman
keyword: PBEPBE/SDD
title: #p freq=noraman PBEPBE/SDD
converged: YES YES NO NO
title: Mulliken charges:
elementType: Cl S S F O O O N N N N N N C C C C C C C C C C C C C C C C C C C C H H H H H H H H H H H H H H H H H H H H H H
charge: -0.051432 0.224713 1.091028 -0.347188 -0.236876 -0.478290 -0.483060 -0.314473 -0.086122 -0.164073 -0.625140 -0.612200 -0.458430 0.190468 -0.674732 -0.722448 0.380161 0.213159 -0.016440 -0.329197 -0.365967 -0.065078 -0.208370 -0.224488 -0.661668 -0.511431 0.227502 0.507838 -0.136796 -0.422826 -0.315144 -0.188816 -0.205307 0.237249 0.196935 0.238648 0.219819 0.235804 0.246759 0.277166 0.269090 0.263120 0.339165 0.338470 0.298709 0.287536 0.323249 0.319718 0.242164 0.275895 0.321606 0.241113 0.324965 0.287835 0.286108
chargesum: 0.00000
title: Mulliken charges with hydrogens summed into heavy atoms:
elementType: Cl S S F O O O N N N N N N C C C C C C C C C C C C C C C C C C C C
charge: -0.051432 0.224713 1.091028 -0.347188 -0.236876 -0.478290 -0.483060 -0.314473 -0.086122 -0.164073 0.052495 0.030767 -0.136824 0.190468 -0.001899 -0.020067 0.380161 0.213159 -0.016440 -0.052031 -0.096877 -0.065078 0.054750 -0.224488 -0.075424 0.006629 0.227502 0.507838 -0.136796 -0.181714 0.009821 0.099019 0.080801
polarizability: 5.72600156e+02 1.46468743e+01 3.02280762e+02 -3.07561310e+01 -1.79550207e+01 2.24718454e+02
1716.lowfreq: -11.3207 -4.9115 -1.5552 -1.0073 -0.0014 -0.0006 0.0005 5.0058 9.6141
frequency: -7.1312 4.0910 8.3990 17.8388 29.2681 30.4581 36.5802 46.9061 60.7379 64.9042 83.2318 89.8656 98.5225 112.2069 118.9198 125.7821 131.2370 152.6261 172.2974 181.9364 192.4465 194.7880 206.4938 222.1644 225.8677 235.3238 251.0486 259.7389 267.3851 291.0838 305.1959 312.6772 323.3569 331.5917 345.9413 357.3747 362.3423 369.7171 385.2146 386.3121 391.6147 409.6649 412.4719 443.0971 449.2648 450.0511 473.7940 487.7481 507.9788 508.4058 517.9406 525.0030 534.6183 550.4349 567.7411 570.4301 591.6345 604.1936 617.0638 630.7912 659.7936 662.5928 666.3690 666.9120 706.4982 717.6716 724.2440 740.1201 763.4601 766.3795 809.4512 818.3026 829.7396 833.9941 852.3436 861.4498 861.9592 881.5062 914.3566 930.2133 941.7700 947.8217 960.0935 963.6785 974.9739 982.7366 991.9606 993.2613 1000.4017 1001.3293 1041.1029 1050.0729 1070.7835 1104.4565 1108.4021 1122.6967 1125.1826 1130.6995 1131.1566 1136.0706 1154.4083 1188.2648 1193.2568 1228.4661 1235.7988 1248.6929 1267.7488 1278.0137 1282.2754 1296.7641 1329.0663 1331.8361 1367.2157 1371.0052 1385.9839 1390.7954 1400.1904 1413.3009 1428.1273 1438.5901 1446.3835 1447.5350 1456.3565 1461.1463 1468.5448 1474.3030 1476.4283 1501.8959 1530.9011 1543.8131 1570.5167 1587.4990 1590.2353 1598.3592 1612.4795 1620.8905 1636.5972 2980.9621 2983.0101 3003.3975 3035.3790 3059.6103 3080.6266 3096.1427 3105.9744 3113.4081 3132.9570 3140.2491 3149.5658 3163.2906 3169.7375 3170.1746 3178.1155 3199.8336 3516.9764 3550.8387 3566.9223 3705.0687 3728.4309
redmass: 4.9024 7.4100 7.8568 8.5283 8.6461 7.6728 6.2842 5.6749 5.1453 5.6803 3.4234 5.9140 3.9650 8.0119 4.9967 4.7969 5.7109 6.7858 8.0297 5.5507 6.5463 3.5538 6.7854 2.3143 2.0852 7.2982 5.2950 1.1059 6.6856 9.8046 2.6770 2.8591 9.0657 3.5771 5.3441 4.7000 6.7158 4.1253 2.0864 1.7009 1.6196 3.2690 2.9895 6.9059 4.6801 3.3305 5.3711 2.5665 1.9504 2.9804 5.1067 1.2861 1.6010 8.1000 2.8857 4.3244 7.5130 5.2645 7.1939 5.3998 1.2217 6.6285 7.4027 7.5263 3.8232 3.2148 10.4098 2.8216 2.4086 3.2302 4.0132 5.2922 1.3878 1.4894 16.8078 1.4610 2.3153 1.6459 1.5568 6.4114 2.0722 4.1388 1.3545 1.3554 1.6544 5.5182 1.3638 14.2865 4.3292 1.3538 3.5453 2.5202 4.0513 1.9017 2.3561 2.2813 1.3130 1.8449 1.2892 1.3919 2.1568 1.1294 3.3842 1.9193 1.3731 2.2450 1.9301 1.1811 2.9043 1.4101 1.6614 4.1563 1.2366 3.9537 3.7314 1.3955 3.4470 4.9661 4.9238 1.0997 1.0954 1.0624 2.6601 1.0754 1.0825 2.3130 1.0617 2.2161 5.1671 2.8244 1.7857 5.5140 6.6806 5.3743 2.5377 2.0894 4.9469 1.0597 1.0350 1.0355 1.0992 1.0594 1.0996 1.0998 1.1007 1.0993 1.0903 1.1072 1.0884 1.0918 1.0969 1.0958 1.0926 1.0954 1.0764 1.0445 1.0438 1.1052 1.1058
irintensity: 0.4759 0.6167 0.8073 0.4610 2.7942 0.9729 1.3338 1.2814 1.7808 0.8667 4.3428 0.1222 0.5302 2.4692 2.8192 0.6924 1.5387 0.2480 1.5548 1.7470 7.5917 4.7014 7.1751 1.5347 2.8424 4.1215 18.7100 0.3721 1.4426 4.8531 7.7742 1.4450 10.3320 9.2084 8.9356 11.0654 3.0390 6.2266 34.8699 146.5551 158.8391 61.9452 0.0298 46.7345 28.5426 17.0297 10.6102 61.9511 14.0320 34.2627 2.4409 23.5580 48.4896 126.0009 33.9789 15.4782 79.9037 9.6808 12.6841 15.3455 45.6896 11.3280 12.9139 15.1766 2.4713 2.1171 24.6299 4.0492 19.5326 29.4020 63.6945 1.6532 32.4690 27.7580 139.2941 57.0759 8.2527 5.5358 0.9690 19.8713 16.8523 14.1571 1.2934 0.9138 11.5383 7.3760 0.1215 74.1184 12.5169 4.6564 18.8864 59.9441 10.7282 1.6033 29.8588 5.0398 7.9185 40.0974 9.2315 2.0657 187.8852 15.2086 38.6300 22.0319 12.0713 31.7781 95.8922 20.3959 115.1955 51.0514 39.1268 14.6366 40.2135 399.4822 17.6958 49.8073 413.7971 23.3767 270.0497 16.5586 16.0072 3.0811 191.2892 9.1371 3.4228 31.4154 25.2918 637.8647 150.8993 176.5562 217.5588 215.8408 132.3504 84.4785 618.8556 376.5465 82.5705 35.6456 18.8400 15.4837 5.9184 5.9679 32.5028 13.2636 25.5501 25.5780 8.7816 6.1736 3.7572 3.8825 2.8424 6.5870 0.7455 13.8357 19.1797 61.9746 110.7386 52.0155 39.6580
temp: 298.150 k
press: 1.00000 atm
elementType: 17 16 16 9 8 8 8 7 7 7 7 7 7 6 6 6 6 6 6 6 6 6 6 6 6 6 6 6 6 6 6 6 6 1 1 1 1 1 1 1 1 1 1 1 1 1 1 1 1 1 1 1 1 1 1
symmnumber: 1
zpe: 1059689.1 jmol-1
zpe.correction: 0.403614 hartree
zpe.thermalcorrener: 0.437005 hartree
zpe.thermalcorrenthalpy: 0.437949 hartree
zpe.thermalcorrgfe: 0.333266 hartree
zpe.sumelectzpe: -2682.975699 hartree
zpe.sumelectthermal: -2682.942309 hartree
zpe.sumelectthermalent: -2682.941365 hartree
zpe.sumelectthermalfe: -2683.046047 hartree
dipole: 7.4553 -7.4690 1.3964
dipole: 10.6450
quadrupole: -292.9164 -213.1742 -216.9896
quadrupole: 27.3849 -4.1734 -4.5247
quadrupole: -51.8897 27.8526 24.0371 27.3849 -4.1734 -4.5247
hfenergy: -2683.3793138 hartree
pointgroup: C01 [X(C20H22Cl1F1N6O3S2)]
dipole: 2.873023 -2.7105624 -1.3923403 debye
polarizability: 570.2507768|31.3915792|293.2217622|-32.4056825|29.2979278|236.1268327 unknown
InChI: InChI=1S/C20H22ClFN6O3S2/c1-20(2)27-18(23)26-19(24)28(20)13-5-8-16(15(21)11-13)32-10-9-17(29)25-12-3-6-14(7-4-12)33(22,30)31/h3-8,11,25H,9-10,23-24H2,1-2H3
charge 0 multiplicity 1
55 atoms
Cl 0.923836 -1.548295 1.13288
S  0.685972 -2.276859 -2.171667
S  -9.522046 1.086863 1.196716
F  -9.146287 1.302815 3.007177
O  -2.900165 0.572992 -1.066397
O  -9.722887 2.571297 0.615153
O  -10.672532 -0.034358 1.125502
N  5.740738 0.280138 0.175207
N  6.996206 2.38415 0.5630
N  8.150961 0.244912 0.235138
N  6.982511 -1.715925 -0.228299
N  9.306953 2.270618 0.168898
N  -4.222415 -1.288648 -0.512454
C  5.762326 1.655231 0.900611
C  5.713748 1.410027 2.43396
C  4.57248 2.509488 0.425069
C  4.545452 -0.310433 -0.344565
C  6.976591 -0.367507 0.067841
C  8.081665 1.654408 0.342908
C  3.445394 -0.605383 0.504592
C  4.437341 -0.60764 -1.731023
C  2.277009 -1.170051 -0.036853
C  3.25664 -1.172639 -2.248506
C  2.143635 -1.462039 -1.415338
C  -0.695109 -0.988973 -1.8787
C  -1.903312 -1.675331 -1.227638
C  -3.032021 -0.676226 -0.942305
C  -5.439282 -0.680788 -0.123227
C  -7.886352 0.38095 0.670826
C  -6.497196 -1.543079 0.288329
C  -5.633784 0.730946 -0.134503
C  -7.733561 -1.016702 0.695821
C  -6.870522 1.265898 0.272321
H  6.549987 0.759852 2.746871
H  4.760481 0.946858 2.748641
H  5.817991 2.378722 2.952391
H  3.596971 2.097255 0.731819
H  4.594891 2.620744 -0.6722
H  4.691193 3.510685 0.869749
H  3.513708 -0.417318 1.578736
H  5.274221 -0.372256 -2.395584
H  3.16939 -1.378465 -3.319896
H  6.135354 -2.277203 -0.213553
H  7.893118 -2.153327 -0.346395
H  -0.29105 -0.198585 -1.230438
H  -0.945561 -0.550984 -2.856714
H  10.114837 1.701156 -0.063301
H  9.369174 3.281691 0.243376
H  -2.280632 -2.492583 -1.874526
H  -1.581692 -2.142488 -0.275903
H  -4.201164 -2.310709 -0.457689
H  -6.350236 -2.629596 0.294434
H  -4.819801 1.382739 -0.454484
H  -8.55423 -1.668035 1.010688
H  -7.039337 2.347192 0.266506
