program: Gaussian 09
title: 000282237
version: EM64L-G09RevD.01
frameworkgroup: C1[X(C16H16S)]
method: RPBEPBE
basis: SDD
operation: Freq
keyword: #pfreq=noraman
keyword: PBEPBE/SDD
title: #p freq=noraman PBEPBE/SDD
converged: YES YES NO NO
title: Mulliken charges:
elementType: S C C C C C C C C C C C C C C C C H H H H H H H H H H H H H H H H
charge: 0.183373 0.094932 0.094912 0.395757 0.395767 0.285815 0.285794 -0.939101 -0.939098 -0.422370 -0.422372 -0.387939 -0.387897 -0.243776 -0.243781 -0.835893 -0.835892 0.269308 0.289683 0.269307 0.289683 0.238833 0.238835 0.232791 0.232790 0.226223 0.226223 0.247200 0.230591 0.226256 0.226260 0.247209 0.230577
chargesum: 0.00000
title: Mulliken charges with hydrogens summed into heavy atoms:
elementType: S C C C C C C C C C C C C C C C C
charge: 0.183373 0.094932 0.094912 0.395757 0.395767 0.285815 0.285794 -0.380110 -0.380108 -0.183536 -0.183537 -0.155149 -0.155107 -0.017553 -0.017558 -0.131845 -0.131846
polarizability: 2.28240114e+02 2.40752147e-04 1.94470692e+02 -5.67184815e+00 1.04166012e-04 1.29353888e+02
1716.lowfreq: -26.2701 -10.8514 -0.0020 -0.0015 -0.0012 6.1833 13.3416 68.6716 86.4010
frequency: -23.4113 68.3871 86.3890 101.6845 107.3999 160.8935 167.4684 227.0396 230.6692 231.2418 271.1290 315.5378 343.8474 350.7938 395.3105 420.8997 441.6722 496.5095 505.6830 516.7150 540.2502 555.3641 567.4122 574.7471 617.4113 639.1039 657.7307 730.3000 750.6929 773.5013 783.6476 802.2473 807.8209 861.3030 892.5805 911.3164 911.9259 948.9225 949.3640 978.9681 979.8156 992.7428 1013.4708 1019.3231 1045.5361 1046.3687 1088.2548 1099.1354 1130.1301 1148.6364 1178.0401 1178.8606 1230.3307 1235.8333 1245.3047 1252.4632 1257.8726 1263.3408 1274.4850 1360.3324 1364.0645 1396.9579 1397.2142 1422.6415 1444.5413 1452.9138 1455.9066 1461.1292 1463.5216 1467.9545 1474.0856 1481.5893 1490.3167 1578.7046 1588.3385 1601.2319 1602.1959 2978.2830 2978.4728 3034.4826 3035.2015 3055.5879 3057.5629 3092.1758 3092.2339 3106.4695 3106.7708 3117.4768 3117.5944 3128.3434 3128.3726 3154.5431 3154.8138
redmass: 1.0844 3.5830 3.2255 4.1303 6.7181 3.5902 1.2157 2.3788 3.6052 3.5311 6.3243 2.4019 3.9298 3.4056 3.2346 2.6192 2.8432 4.7380 4.2121 4.6980 4.7427 4.2324 5.1192 3.7035 4.7442 4.5621 5.5312 5.8868 2.1042 2.0154 3.5416 1.7928 2.6098 1.5939 1.9962 1.4213 1.3928 2.1387 2.2679 1.3661 1.3433 6.6707 1.8692 1.8719 1.5742 1.5428 1.8138 1.5646 1.1603 1.1216 1.1507 1.1392 1.1577 1.7340 2.2907 1.7419 3.8084 1.6878 2.6670 6.1820 7.8117 1.2236 1.2387 2.3210 2.2823 1.1464 1.5662 1.4603 2.1442 1.1927 1.1373 1.0758 1.2957 6.4988 7.3058 6.0968 6.1824 1.0386 1.0392 1.0578 1.0582 1.0950 1.0942 1.0991 1.0992 1.1074 1.1066 1.0863 1.0862 1.0912 1.0912 1.0994 1.0993
irintensity: 1.0064 0.7597 0.0612 0.6982 1.1836 2.2798 0.2156 0.0143 0.4639 1.2650 1.3749 3.9779 8.2017 2.4407 0.0237 0.3915 1.0231 2.5845 0.2826 1.0536 4.2572 0.4229 0.1152 0.0063 5.6605 4.6524 7.2268 4.3242 45.4058 19.3518 1.8487 35.2693 9.4919 3.9587 0.8333 0.2157 0.6934 0.1664 6.1311 0.5404 0.0277 5.6336 5.0240 3.0477 4.0290 10.8734 0.0625 7.8864 6.6784 7.5302 2.2031 2.1576 3.6900 1.1149 1.9657 0.0405 1.1734 2.5143 0.0000 0.8666 0.3369 19.7000 11.3100 1.5846 5.5779 3.9938 5.9268 29.0287 12.4817 14.3924 0.6903 30.8837 8.6733 5.9517 1.6779 3.4713 0.6358 46.6731 9.3387 36.2673 1.2535 39.6017 2.7167 21.7703 3.7534 3.5236 6.7149 2.8223 4.0908 11.9183 26.1950 73.0924 0.0027
temp: 298.150 k
press: 1.00000 atm
elementType: 16 6 6 6 6 6 6 6 6 6 6 6 6 6 6 6 6 1 1 1 1 1 1 1 1 1 1 1 1 1 1 1 1
symmnumber: 1
zpe: 707087.8 jmol-1
zpe.correction: 0.269316 hartree
zpe.thermalcorrener: 0.283628 hartree
zpe.thermalcorrenthalpy: 0.284572 hartree
zpe.thermalcorrgfe: 0.228904 hartree
zpe.sumelectzpe: -1016.176953 hartree
zpe.sumelectthermal: -1016.162641 hartree
zpe.sumelectthermalent: -1016.161696 hartree
zpe.sumelectthermalfe: -1016.217364 hartree
dipole: -0.0001 -2.3666 0.0000
dipole: 2.3666
quadrupole: -98.6452 -109.4794 -105.6209
quadrupole: 0.0000 -1.1106 0.0000
quadrupole: 5.9366 -4.8976 -1.0391 0.0000 -1.1106 0.0000
hfenergy: -1016.4462684 hartree
pointgroup: C01 [X(C16H16S1)]
dipole: 0.0002067 -0.9310806 0.0000719 debye
polarizability: 228.5144409|0.0054202|194.4706928|-2.2287598|-0.0040889|129.0795606 unknown
InChI: InChI=1S/C16H16S/c1-11-5-3-7-13-9-17-10-14-8-4-6-12(2)16(14)15(11)13/h3-8H,9-10H2,1-2H3
charge 0 multiplicity 1
33 atoms
S  -0.000557 3.196856 -0.000228
C  -0.752919 -0.256164 -0.01475
C  0.75306 -0.255905 0.014699
C  -1.447255 0.82251 0.6239
C  1.447025 0.822953 -0.624044
C  -1.497352 -1.266422 -0.697511
C  1.497841 -1.265837 0.697564
C  -0.662069 1.931619 1.279858
C  0.661458 1.931705 -1.280146
C  -2.86158 0.859974 0.61358
C  2.861336 0.860925 -0.613698
C  -2.915093 -1.201125 -0.687496
C  2.915559 -1.200034 0.687568
C  -3.597734 -0.156775 -0.030116
C  3.597841 -0.155499 0.030111
C  -0.823055 -2.39407 -1.46272
C  0.823946 -2.393666 1.46286
H  -1.28496 2.540216 1.954672
H  0.214156 1.552951 1.829658
H  1.28415 2.540451 -1.95501
H  -0.214613 1.552662 -1.829932
H  -3.380429 1.691588 1.104381
H  3.379897 1.692679 -1.104565
H  -3.484538 -1.976416 -1.214749
H  3.485271 -1.975077 1.214899
H  -4.692994 -0.127024 -0.033587
H  4.69309 -0.125355 0.033603
H  0.204537 -2.131472 -1.764308
H  -0.762884 -3.315967 -0.852487
H  -1.398141 -2.645006 -2.371755
H  1.398911 -2.644061 2.372122
H  -0.203874 -2.131565 1.764097
H  0.764473 -3.315747 0.852835
