program: Gaussian 09
title: 000282227
version: EM64L-G09RevD.01
frameworkgroup: C1[X(C14H14O3)]
method: RPBEPBE
basis: SDD
operation: Freq
keyword: #pfreq=noraman
keyword: PBEPBE/SDD
title: #p freq=noraman PBEPBE/SDD
converged: YES YES NO YES
title: Mulliken charges:
elementType: O O O C C C C C C C C C C C C C C H H H H H H H H H H H H H H
charge: -0.275947 -0.263836 -0.245533 0.003482 -0.457229 -0.553884 -0.509915 0.088144 0.165195 0.046064 0.194107 0.162654 -0.357742 -0.354595 -0.515802 -0.249101 -0.209477 0.193763 0.232527 0.235768 0.259200 0.251689 0.249679 0.244452 0.281158 0.262026 0.197998 0.233085 0.219754 0.236003 0.236314
chargesum: 0.00000
title: Mulliken charges with hydrogens summed into heavy atoms:
elementType: O O O C C C C C C C C C C C C C C
charge: -0.275947 -0.263836 -0.245533 0.197246 0.011066 -0.042995 -0.015784 0.088144 0.165195 0.046064 0.194107 0.162654 -0.076585 -0.092569 0.135035 -0.013098 0.026837
polarizability: 2.26346117e+02 -2.64134849e+00 1.67793169e+02 -3.23352061e+00 3.77738918e+00 8.35688248e+01
1716.lowfreq: -7.9202 -3.7222 0.0009 0.0009 0.0010 3.7433 40.6225 71.9961 99.9830
frequency: 40.6063 71.9891 99.9823 106.3171 143.9787 154.5544 178.5458 216.0077 240.8445 275.1751 294.3459 305.6996 315.8732 403.9702 419.2262 434.6826 463.5969 484.9693 499.7917 525.7757 536.9473 576.4286 600.3232 656.4421 690.9774 710.4921 767.9271 791.0748 811.1308 829.7507 834.5651 883.9398 906.5855 913.1140 937.6538 972.2527 998.4770 1001.3972 1022.4837 1057.1161 1064.0568 1093.7167 1105.5756 1111.2017 1117.3611 1136.0212 1152.8592 1162.1293 1162.7033 1186.7778 1206.0195 1220.9096 1237.9479 1260.6804 1286.4802 1300.7300 1322.3488 1339.3434 1367.1716 1385.8579 1401.8471 1436.1379 1446.6668 1451.7981 1456.0795 1461.4199 1464.6466 1476.1729 1479.0388 1545.4686 1579.8657 1620.1448 1630.5535 2906.7588 2935.0636 2976.8802 2984.9353 3009.8262 3017.8873 3040.4174 3047.9478 3079.4699 3101.5782 3139.2923 3152.1586 3165.3869 3176.0709
redmass: 4.9640 2.8661 4.0446 2.8626 4.2417 2.9309 1.9641 1.7999 2.9656 4.5520 5.9582 5.3495 4.0529 3.5837 4.6121 3.2488 2.4290 4.3488 5.7606 4.0208 4.3730 5.7557 6.5887 5.3870 3.9713 5.2602 1.7879 2.0624 2.4549 5.1555 3.2641 1.4621 2.2928 1.9474 3.9270 1.3661 2.2882 1.3295 2.0447 4.3205 3.0178 2.3147 2.4224 1.6032 1.8133 1.3503 2.0119 1.2134 1.7117 1.9220 2.9719 1.3637 1.4275 1.5420 1.5265 1.3446 1.6931 1.4456 1.5757 3.9533 9.1658 1.1357 2.5294 1.1524 1.0738 2.6065 1.0826 1.0937 1.0531 10.2482 7.3454 7.0292 7.4981 1.0830 1.0355 1.0646 1.0633 1.0633 1.1004 1.0932 1.0964 1.1026 1.0982 1.0861 1.0901 1.0955 1.1001
irintensity: 0.9228 3.5402 7.5349 1.0834 0.7513 1.3603 1.1897 1.9353 7.0417 0.5121 3.8046 2.8048 0.3118 9.1774 0.9504 1.1508 2.3914 0.4529 4.5508 0.8893 4.2707 2.0297 9.5083 9.5707 11.5440 9.1390 77.2904 21.3418 1.8622 12.9641 7.7509 0.5643 2.2529 11.6974 2.2226 3.1283 7.2538 0.2619 7.0028 120.9742 5.4592 18.2454 67.9416 4.1255 6.9987 9.7803 6.2064 1.0966 43.6870 3.0371 40.4490 2.6777 1.0026 17.7093 46.5313 5.0633 34.5677 32.2022 31.1192 72.7930 23.2501 5.1695 69.8002 14.3422 22.4147 0.3427 4.7827 11.8197 16.0779 162.4128 12.1002 39.7910 110.2340 46.5395 74.9674 17.0779 9.2526 23.8704 62.4987 17.4745 10.9063 32.2484 37.0512 3.8098 4.4656 11.1594 18.7476
temp: 298.150 k
press: 1.00000 atm
elementType: 8 8 8 6 6 6 6 6 6 6 6 6 6 6 6 6 6 1 1 1 1 1 1 1 1 1 1 1 1 1 1
symmnumber: 1
zpe: 649443.1 jmol-1
zpe.correction: 0.247360 hartree
zpe.thermalcorrener: 0.261767 hartree
zpe.thermalcorrenthalpy: 0.262711 hartree
zpe.thermalcorrgfe: 0.206032 hartree
zpe.sumelectzpe: -766.324937 hartree
zpe.sumelectthermal: -766.310530 hartree
zpe.sumelectthermalent: -766.309586 hartree
zpe.sumelectthermalfe: -766.366264 hartree
dipole: -1.0797 2.7303 1.2844
dipole: 3.2046
quadrupole: -85.3630 -101.1534 -100.6161
quadrupole: -4.0252 4.2650 -1.1197
quadrupole: 10.3478 -5.4426 -4.9052 -4.0252 4.2650 -1.1197
hfenergy: -766.5722966 hartree
pointgroup: C01 [X(C14H14O3)]
dipole: 0.4043214 1.0843262 -0.500387 debye
polarizability: 226.2342446|3.8949132|167.9517653|-2.5094864|-3.5816828|83.5221012 unknown
InChI: InChI=1S/C14H14O3/c1-16-9-6-7-13-11(8-9)14(15)10-4-2-3-5-12(10)17-13/h2-5,9H,6-8H2,1H3
charge 0 multiplicity 1
31 atoms
O  -4.480221 -0.204655 0.150031
O  0.858269 1.624888 -0.065885
O  0.299332 -2.509472 0.211997
C  -3.119272 0.185295 -0.243737
C  -2.867753 1.549999 0.417876
C  -2.059072 -0.843739 0.206671
C  -1.497317 2.123526 -0.009139
C  -0.647684 -0.292479 0.118735
C  -0.424451 1.064785 0.025034
C  0.476927 -1.246231 0.133019
C  1.829889 -0.636994 0.042099
C  1.978058 0.770347 -0.057043
C  3.004528 -1.436056 0.047112
C  3.244027 1.387823 -0.149377
C  -4.971006 -1.405771 -0.527438
C  4.273492 -0.841206 -0.043618
C  4.39134 0.573467 -0.142218
H  -3.076109 0.295335 -1.353944
H  -2.904385 1.416381 1.515209
H  -3.678534 2.246352 0.142526
H  -2.098515 -1.773433 -0.389621
H  -2.277439 -1.14296 1.251625
H  -1.199249 2.962537 0.646929
H  -1.55075 2.541273 -1.035254
H  2.874998 -2.520646 0.123332
H  3.307294 2.477262 -0.223666
H  -4.89095 -1.30828 -1.631554
H  -6.031553 -1.498981 -0.244706
H  -4.428097 -2.3174 -0.207113
H  5.1746 -1.462939 -0.039023
H  5.381603 1.035972 -0.213162
