program: Gaussian 09
title: 000282215
version: EM64L-G09RevD.01
frameworkgroup: C1[X(C13H10Cl2O2)]
method: RPBEPBE
basis: SDD
operation: Freq
keyword: #p
keyword: freq=noraman
keyword: PBEPBE/SDD
title: #p freq=noraman PBEPBE/SDD
converged: YES YES NO NO
title: Mulliken charges:
elementType: Cl Cl O O C C C C C C C C C C C C C H H H H H H H H H H
charge: -0.005551 -0.035830 -0.242794 -0.235991 -0.417705 -0.405796 -0.507677 -0.495584 0.104969 0.182334 0.052054 0.238045 0.305002 -0.347860 -0.285252 -0.129149 -0.225258 0.217894 0.210670 0.219259 0.215920 0.237936 0.259958 0.245817 0.251643 0.307692 0.285254
chargesum: 0.00000
title: Mulliken charges with hydrogens summed into heavy atoms:
elementType: Cl Cl O O C C C C C C C C C C C C C
charge: -0.005551 -0.035830 -0.242794 -0.235991 0.010859 0.029383 -0.009782 0.001876 0.104969 0.182334 0.052054 0.238045 0.305002 -0.040168 -0.285252 -0.129149 0.059996
polarizability: 2.36140190e+02 6.61334764e+00 1.90789932e+02 -9.47053375e-02 -8.23596509e-01 7.77959723e+01
1716.lowfreq: -9.5284 -6.7357 -0.0027 -0.0022 -0.0017 5.4631 43.0510 67.5578 99.0320
frequency: 43.0163 67.5111 99.0159 125.5945 126.2292 163.8980 174.1280 194.9610 251.1766 271.6119 301.2228 319.6285 325.2903 358.7235 388.9865 422.5566 449.8397 481.8742 495.1981 522.6859 546.2818 559.7004 586.0669 665.3945 682.9016 694.9263 757.6883 774.3963 821.9093 823.4001 856.4418 868.0742 891.4406 901.7783 926.2452 939.5968 977.4969 1069.4465 1080.3085 1091.5663 1110.4658 1132.8532 1141.1330 1155.3177 1177.3249 1212.5720 1222.6625 1238.4994 1254.8169 1295.5442 1332.8265 1340.8956 1352.6574 1373.6727 1391.4357 1406.8582 1425.3651 1448.6791 1457.6367 1472.3601 1477.5512 1542.8661 1564.0170 1601.9683 1628.6683 2978.2126 2980.7603 2985.4530 2992.5897 3039.2568 3042.5362 3053.1006 3061.9923 3172.2812 3183.1048
redmass: 6.4274 4.1846 3.1054 8.3556 7.3593 19.1396 4.4287 5.2302 6.9116 2.6642 5.2823 2.4203 11.2803 6.7422 8.0649 4.8558 4.3274 4.8151 7.1558 3.0044 4.4632 4.4095 5.7492 5.1460 4.9722 5.5879 8.1573 4.0701 2.4808 2.6287 3.4272 1.4159 2.3150 1.6932 1.4197 3.4128 2.6433 2.0689 1.9693 1.9736 3.7474 1.5428 1.9097 2.3097 1.7562 1.7266 3.4526 1.2849 1.3133 1.7744 1.3896 1.4677 1.6104 3.1886 11.4468 4.5661 4.2504 1.1255 1.0862 1.0872 1.0925 9.6677 9.9210 9.0568 7.2731 1.0640 1.0674 1.0636 1.0623 1.0945 1.0939 1.0985 1.1035 1.0929 1.0936
irintensity: 1.4888 0.0186 2.0094 1.0083 0.6518 0.4122 2.5563 0.6771 1.4137 3.0349 3.7333 0.0468 4.7158 0.4023 4.7759 1.4430 1.4542 3.6735 2.1694 0.3842 2.6175 5.4202 2.0755 49.4616 9.9011 5.0069 50.2435 15.5430 3.4090 16.5301 4.8777 21.7929 16.6806 9.2382 12.2388 6.5677 19.7237 0.9958 11.0286 10.7252 3.4121 59.8317 80.6689 12.8158 21.3845 13.7433 9.2929 7.1458 25.1639 74.0422 7.7965 2.2948 2.6065 71.0698 4.4499 14.3750 199.1017 17.1370 13.1952 10.9549 14.5097 268.7581 11.2069 3.5131 84.9240 12.3939 10.6385 34.4768 33.0135 19.3483 6.9452 55.9976 50.4585 7.6719 1.1733
temp: 298.150 k
press: 1.00000 atm
elementType: 17 17 8 8 6 6 6 6 6 6 6 6 6 6 6 6 6 1 1 1 1 1 1 1 1 1 1
symmnumber: 1
zpe: 516464.6 jmol-1
zpe.correction: 0.196711 hartree
zpe.thermalcorrener: 0.211083 hartree
zpe.thermalcorrenthalpy: 0.212027 hartree
zpe.thermalcorrgfe: 0.154697 hartree
zpe.sumelectzpe: -1570.751041 hartree
zpe.sumelectthermal: -1570.736669 hartree
zpe.sumelectthermalent: -1570.735725 hartree
zpe.sumelectthermalfe: -1570.793055 hartree
dipole: 3.1502 2.6552 -0.0200
dipole: 4.1200
quadrupole: -98.2713 -123.8767 -111.9548
quadrupole: 0.8789 0.0424 0.1380
quadrupole: 13.0963 -12.5091 -0.5872 0.8789 0.0424 0.1380
hfenergy: -1570.9477522 hartree
pointgroup: C01 [X(C13H10Cl2O2)]
dipole: 1.2179474 1.0695475 -0.0104541 debye
polarizability: 235.8533329|7.5275444|191.0717132|-0.0700929|-1.1209523|77.8010481 unknown
InChI: InChI=1S/C13H10Cl2O2/c14-7-5-9-12(16)8-3-1-2-4-11(8)17-13(9)10(15)6-7/h5-6H,1-4H2
charge 0 multiplicity 1
27 atoms
Cl -1.900071 3.284019 -0.048926
Cl -4.866998 -1.405977 0.015535
O  0.440343 1.416689 -0.016084
O  0.44595 -2.758842 0.039297
C  4.203241 -0.51193 -0.377602
C  4.12968 0.839263 0.37104
C  3.015987 -1.423093 0.006496
C  2.839506 1.604676 -0.007471
C  1.686637 -0.688916 0.005866
C  1.644716 0.688432 -0.004214
C  0.446845 -1.483022 0.021229
C  -0.820326 -0.695616 0.009764
C  -0.77097 0.722827 -0.011728
C  -2.07719 -1.353287 0.017843
C  -1.969999 1.476413 -0.023829
C  -3.244544 -0.584667 0.005266
C  -3.21517 0.831705 -0.015608
H  5.15481 -1.02566 -0.148011
H  4.19306 -0.325312 -1.470067
H  5.009305 1.465846 0.136666
H  4.143233 0.654442 1.46296
H  3.176087 -1.860372 1.012797
H  2.934665 -2.289273 -0.675585
H  2.939498 2.05532 -1.015896
H  2.650484 2.444663 0.686955
H  -2.087074 -2.446822 0.033811
H  -4.139606 1.41429 -0.024806
