program: Gaussian 09
title: 000282252
version: EM64L-G09RevD.01
frameworkgroup: C1[X(C18H25NO3S)]
method: RPBEPBE
basis: SDD
operation: Freq
keyword: #p
keyword: freq=noraman
keyword: PBEPBE/SDD
title: #p freq=noraman PBEPBE/SDD
converged: YES YES NO NO
title: Mulliken charges:
elementType: S O O O N C C C C C C C C C C C C C C C C C C H H H H H H H H H H H H H H H H H H H H H H H H H
charge: 0.946898 -0.545249 -0.551608 -0.236872 -0.183587 0.475443 -0.476099 -0.620806 -0.535531 -0.398927 -0.379477 -0.355718 0.581148 -0.413255 -0.370333 -0.358398 -0.324724 -0.335151 -0.432533 -0.365167 -0.232043 -0.254291 -0.236559 0.289363 0.270971 0.240234 0.220029 0.235365 0.224219 0.225275 0.191860 0.200979 0.202182 0.205661 0.197095 0.244571 0.199722 0.207625 0.233741 0.224338 0.191410 0.190351 0.218325 0.230987 0.260717 0.231668 0.232270 0.233880
chargesum: 0.00000
title: Mulliken charges with hydrogens summed into heavy atoms:
elementType: S O O O N C C C C C C C C C C C C C C C C C C
charge: 0.946898 -0.545249 -0.551608 -0.236872 -0.183587 0.475443 -0.186736 -0.349835 -0.075268 0.060657 0.037658 0.047443 0.581148 -0.010498 0.071033 0.085895 0.083952 0.080597 -0.201546 -0.104449 -0.000375 -0.022021 -0.002679
polarizability: 2.62605474e+02 -1.45642509e+01 2.34539943e+02 -2.09435930e+01 6.14768825e+00 2.06650211e+02
1716.lowfreq: -11.6071 -9.3910 -5.2912 -0.0012 0.0012 0.0015 11.4107 36.8777 48.3324
frequency: 9.0799 36.8106 48.2291 65.4835 76.8159 95.8038 121.2414 121.8608 135.3879 172.1942 180.4686 201.7960 204.9273 216.3096 223.3871 239.6522 278.4994 287.5290 312.2778 333.7242 344.0224 367.8712 379.0369 391.3718 404.6960 419.9452 429.0179 452.1127 460.3733 492.4342 502.6667 560.9098 580.4368 591.4849 610.6799 616.9123 665.6981 693.7539 698.4878 755.1744 771.4241 795.4812 802.6118 807.7286 826.2387 839.5734 847.6948 856.5719 857.1775 882.8148 897.2719 905.0300 913.5825 927.5763 948.8627 968.5983 973.4325 989.1699 996.4464 998.3060 1011.8588 1021.9593 1029.5866 1037.3464 1049.2883 1053.8860 1069.5481 1077.2548 1083.6226 1092.0128 1097.6702 1108.3057 1124.7313 1135.6416 1167.6429 1172.7895 1177.0308 1192.7180 1198.9508 1199.7364 1226.4445 1231.9745 1251.7341 1267.8589 1272.9466 1280.2805 1288.8161 1298.4117 1316.4966 1330.8430 1335.5818 1339.8309 1344.2819 1346.9583 1350.5888 1355.3100 1361.9922 1368.7524 1374.8295 1384.2596 1440.9652 1442.7801 1448.2223 1452.6797 1459.1529 1462.6475 1464.4056 1466.1987 1471.4721 1480.9376 1495.1005 1581.8531 1606.1458 2879.4188 2892.6207 2950.4793 2959.0961 2964.3230 2976.0997 2982.2888 2995.7996 3010.7966 3024.3363 3034.9583 3044.5941 3049.9893 3050.4107 3060.0402 3066.3324 3079.8340 3082.2134 3084.2534 3086.7995 3117.6087 3131.8350 3144.0682 3155.8459 3168.5040
redmass: 5.4555 4.1437 3.7956 3.7138 4.2337 5.6493 6.6241 4.3837 3.7836 5.1473 4.4140 4.7885 6.7299 3.0595 2.7419 4.2518 2.6162 2.5107 2.9514 2.8397 2.9562 5.1848 4.4357 2.9766 2.8328 2.4022 3.4554 4.4050 2.7813 2.3125 2.1485 3.4127 3.0018 4.5650 4.0634 5.4376 2.5319 3.7396 1.6758 2.4450 2.3299 2.5561 4.6623 6.2477 2.1270 1.6840 1.2901 1.9340 2.1427 2.5953 4.3928 2.5169 2.3264 1.7830 2.8711 2.1838 1.4468 4.3409 2.0025 1.4502 1.3946 2.2029 2.1438 2.0846 2.0241 1.8636 1.5396 2.8196 2.6730 1.5848 2.5605 2.1938 2.2101 3.3674 2.3548 1.3178 1.2074 1.1028 1.1257 1.1244 2.0269 1.3666 1.5261 1.2688 1.2276 1.3390 1.5248 1.2946 1.3372 1.3024 1.3402 1.3107 1.3600 1.2597 1.3977 1.4207 1.4344 1.3949 1.2655 4.3425 2.1385 1.0888 1.0802 1.0973 1.0871 1.0955 1.0904 1.0926 1.0882 2.1688 1.0855 5.6218 5.8700 1.0711 1.0700 1.0670 1.0668 1.0615 1.0627 1.0617 1.0621 1.0655 1.0950 1.1006 1.1006 1.0990 1.0861 1.0974 1.0898 1.0954 1.0881 1.0878 1.0970 1.0879 1.0866 1.0917 1.0957 1.1013
irintensity: 2.2784 0.2642 0.5709 0.1516 1.2859 4.3371 3.1636 5.2045 3.6110 3.8201 2.5122 6.4659 0.5963 7.1719 1.2194 2.6728 3.1178 2.0623 12.9734 2.4120 10.2640 10.0390 8.1615 10.2167 0.8230 10.3271 1.8373 12.9303 0.8225 4.6865 1.5213 11.8748 6.5655 4.8884 8.9750 3.3307 10.4309 0.0427 45.6792 15.4273 2.9531 23.9225 25.3031 96.3912 2.1075 0.2849 0.7626 3.4399 4.0611 0.3551 21.8334 13.9132 25.3936 8.7010 39.8074 2.2540 1.6415 0.2993 38.8334 5.0083 6.2156 5.1043 5.7880 3.8543 15.6968 8.4855 7.3103 24.7086 25.3180 6.0835 15.1233 12.0991 1.8339 10.2222 3.3564 6.5402 5.9849 0.9588 1.0803 3.9037 16.7337 5.1562 25.7168 13.8681 0.8296 1.6911 4.3502 8.1922 4.5390 3.0795 1.3628 1.4278 0.5994 6.3247 2.8635 8.3054 1.2278 1.7535 2.3791 1.9598 14.8055 3.3849 4.0184 17.2013 5.5203 4.3623 3.7008 12.0247 22.0515 7.8201 36.0227 1.8280 0.1672 40.0747 53.4623 48.8258 83.0871 29.4279 32.6388 32.2809 8.2031 18.8153 57.6724 37.2337 32.1807 18.0284 2.7772 26.2711 13.5747 15.6449 46.2664 8.4704 25.2568 6.5602 0.2171 17.1636 21.6836 22.9120
temp: 298.150 k
press: 1.00000 atm
elementType: 16 8 8 8 7 6 6 6 6 6 6 6 6 6 6 6 6 6 6 6 6 6 6 1 1 1 1 1 1 1 1 1 1 1 1 1 1 1 1 1 1 1 1 1 1 1 1 1
symmnumber: 1
zpe: 1048401.5 jmol-1
zpe.correction: 0.399315 hartree
zpe.thermalcorrener: 0.421114 hartree
zpe.thermalcorrenthalpy: 0.422058 hartree
zpe.thermalcorrgfe: 0.347883 hartree
zpe.sumelectzpe: -1377.444599 hartree
zpe.sumelectthermal: -1377.422801 hartree
zpe.sumelectthermalent: -1377.421856 hartree
zpe.sumelectthermalfe: -1377.496031 hartree
dipole: -1.2889 -0.8336 -6.4254
dipole: 6.6062
quadrupole: -146.3092 -143.4375 -160.6271
quadrupole: -16.8665 -9.3862 -6.2600
quadrupole: 3.8154 6.6871 -10.5025 -16.8665 -9.3862 -6.2600
hfenergy: -1377.8439142 hartree
pointgroup: C01 [X(C18H25N1O3S1)]
dipole: 0.4608042 0.4230651 -2.5226732 debye
polarizability: 266.9579892|-1.9110151|228.5326684|24.0730303|0.7020929|208.3049692 unknown
InChI: InChI=1S/C18H25NO3S/c20-23(21)16-9-5-2-6-10-18(16,19-11-13-22-14-12-19)17(23)15-7-3-1-4-8-15/h1,3-4,7-8,16-17H,2,5-6,9-14H2
charge 0 multiplicity 1
48 atoms
S  -0.288307 -1.318144 2.068941
O  -1.177186 -2.686245 1.911053
O  0.091844 -0.749178 3.559156
O  2.735757 3.703777 0.486073
N  1.550483 1.065818 0.077224
C  0.640697 -0.124252 -0.017022
C  1.263308 -1.303817 0.825584
C  -0.760918 0.143256 0.737723
C  0.41303 -0.527856 -1.49714
C  1.498734 -2.689694 0.236097
C  1.703448 -0.799707 -2.316294
C  2.63948 -2.718455 -0.820314
C  -2.105574 0.055729 0.103334
C  2.206905 -2.25986 -2.230965
C  1.230972 2.206643 -0.8249
C  1.81966 1.609541 1.441744
C  2.414347 3.192443 -0.852749
C  3.016425 2.573189 1.384993
C  -2.899415 1.237381 0.045572
C  -2.644054 -1.151483 -0.42738
C  -4.173282 1.227519 -0.55898
C  -3.923728 -1.161183 -1.019314
C  -4.689181 0.025866 -1.097535
H  2.127698 -0.984102 1.427288
H  -0.6787 1.050739 1.359558
H  -0.196731 0.253017 -1.986179
H  -0.222703 -1.430708 -1.515898
H  1.768895 -3.35863 1.07589
H  0.569718 -3.106671 -0.195222
H  2.50518 -0.111536 -1.98618
H  1.498151 -0.569053 -3.380137
H  3.016403 -3.757558 -0.886297
H  3.487883 -2.097728 -0.468156
H  3.066539 -2.38076 -2.919943
H  1.410534 -2.9393 -2.599952
H  2.030522 0.803958 2.164336
H  0.947538 2.181251 1.840791
H  0.309391 2.746118 -0.494271
H  1.064873 1.846804 -1.852553
H  3.205325 3.022377 2.373743
H  3.922363 2.030514 1.038735
H  3.302889 2.679875 -1.282272
H  2.170418 4.081321 -1.458023
H  -2.50784 2.168995 0.473437
H  -2.087674 -2.0885 -0.3252
H  -4.765361 2.14822 -0.600574
H  -4.332249 -2.100242 -1.408294
H  -5.682606 0.011717 -1.559226
