program: Gaussian 09
title: 000282277
version: EM64L-G09RevD.01
frameworkgroup: C1[X(C21H22N4O7)]
method: RPBEPBE
basis: SDD
operation: Freq
keyword: #p
keyword: freq=noraman
keyword: PBEPBE/SDD
title: #p freq=noraman PBEPBE/SDD
converged: YES YES NO NO
title: Mulliken charges:
elementType: O O O O O O O N N N N C C C C C C C C C C C C C C C C C C C C C H H H H H H H H H H H H H H H H H H H H H H
charge: -0.269602 -0.285171 -0.285387 -0.275960 -0.198413 -0.261833 -0.253523 -0.201077 -0.026332 -0.379311 -0.004299 -0.187781 -0.157676 -0.110380 -0.028763 0.352029 -0.374698 -0.687506 -0.691720 0.318492 -0.222770 -0.127752 0.034999 0.180314 -0.238557 0.222264 -0.323970 -0.336564 -0.342388 -0.334678 0.334978 -0.537091 0.281998 0.291647 0.281607 0.279864 0.272494 0.252024 0.245178 0.226567 0.220169 0.228705 0.262541 0.223708 0.289541 0.349319 0.240615 0.270485 0.269356 0.259848 0.247116 0.226514 0.228750 0.252082
chargesum: 0.00000
title: Mulliken charges with hydrogens summed into heavy atoms:
elementType: O O O O O O O N N N N C C C C C C C C C C C C C C C C C C C C C
charge: -0.269602 -0.285171 -0.285387 -0.275960 -0.198413 -0.261833 -0.253523 -0.201077 -0.026332 -0.029992 -0.004299 0.094218 0.133971 0.171227 0.251100 0.352029 0.149819 0.004409 0.023233 0.318492 0.066772 -0.127752 0.034999 0.180314 0.002058 0.222264 -0.053485 -0.067208 -0.082541 -0.087563 0.334978 0.170255
polarizability: 3.62386149e+02 4.01677685e+01 2.90532706e+02 -2.21801138e+01 -1.12108907e+00 2.06048442e+02
1716.lowfreq: -16.4297 -5.5564 -1.8105 -0.0007 -0.0006 0.0002 7.5248 11.7342 21.6480
frequency: -8.0696 10.7701 21.6222 30.0139 35.2269 42.1213 47.8651 73.9695 79.6830 85.6453 93.4948 110.7045 129.9422 145.3736 163.9057 173.8981 177.8601 197.3300 220.0812 231.7415 238.9981 245.5164 254.7532 258.9585 286.3002 302.9548 311.8921 328.1135 330.4630 354.2216 362.3921 382.0199 402.9013 417.0543 458.9495 473.9137 484.6551 484.7659 489.6259 505.2130 510.6162 560.1584 575.3039 583.8786 592.3842 605.0919 627.7358 628.8109 655.4299 658.5417 675.1240 680.7059 703.9413 714.8549 730.7319 743.6985 756.0805 770.0179 774.7653 787.9882 798.5037 824.0494 829.6489 846.8217 854.4015 859.3367 864.5965 888.8569 908.1797 923.2204 929.3816 931.9744 952.7341 971.2818 978.4901 980.2442 985.0791 989.7039 994.9744 1000.8187 1014.6633 1029.0613 1035.3679 1048.7212 1078.1744 1082.3438 1110.8870 1112.3973 1115.5983 1140.1735 1154.5076 1156.5949 1176.2102 1180.5707 1201.3185 1212.5204 1225.5810 1240.6351 1248.0951 1253.0545 1256.8690 1258.8790 1261.6616 1294.0100 1300.5678 1301.9500 1303.8874 1321.7655 1329.8142 1335.0226 1358.8289 1362.4405 1372.9738 1381.4178 1381.8123 1395.1158 1412.4647 1432.8220 1436.9545 1447.2930 1449.7492 1456.5689 1469.1137 1469.6683 1471.7045 1483.9772 1497.6280 1513.0599 1527.6233 1569.0278 1591.1949 1612.6355 1620.5700 1637.2164 2970.0634 2995.0629 3000.0440 3008.1188 3025.5964 3051.6520 3062.6229 3067.7396 3093.2517 3098.3202 3100.9463 3110.6530 3121.9605 3122.0647 3131.7136 3134.7640 3155.0387 3159.9193 3176.3506 3181.6472 3258.6532 3514.8442
redmass: 5.2014 7.1150 4.9850 4.5178 5.8642 5.1965 6.2059 4.9224 5.6520 5.5502 5.2264 7.7113 6.2931 5.0892 2.5917 1.2937 4.8683 7.0204 1.2852 3.4871 1.4850 2.5224 2.9692 3.8723 5.3638 6.7113 4.9172 3.1451 3.9598 5.8940 5.8292 2.7474 5.1935 2.9721 5.6137 3.9846 9.9035 4.0218 3.5316 3.8075 3.4820 4.8960 1.2634 6.8252 6.3595 5.0391 6.5388 3.7624 7.3832 10.3785 6.9990 4.3118 4.8367 6.7727 5.0917 6.8589 4.6594 3.8596 5.1320 6.1013 1.8257 1.3001 5.1526 4.2011 1.6457 5.8057 4.7073 1.4589 3.1147 1.5118 8.0058 4.0294 2.2319 1.3643 3.4462 7.7087 1.3468 1.3457 4.2282 3.6189 3.3484 5.7908 5.2377 4.3555 3.4180 3.6360 2.1997 1.2598 1.3474 1.9567 2.9907 1.3141 1.2786 2.0834 2.3213 1.7916 1.1747 2.9013 1.3738 3.1988 3.5362 1.7134 2.0152 1.3158 1.3010 1.4198 1.3497 3.4125 1.3287 1.9448 1.5058 1.3679 1.4572 2.5210 1.7036 1.2240 3.5514 4.3354 1.1757 1.0894 1.0515 1.0493 1.0597 1.0530 1.0763 1.0526 2.4929 4.6045 5.9561 7.9137 6.4088 10.2050 6.3265 12.3761 1.0326 1.0355 1.0849 1.0358 1.0869 1.0590 1.1044 1.0878 1.0888 1.1000 1.1011 1.0995 1.0926 1.1009 1.1067 1.1001 1.0887 1.0878 1.0967 1.0968 1.0986 1.0802
irintensity: 1.7263 1.9403 0.7994 2.1306 2.6775 1.7620 3.3358 2.6738 2.3004 0.5930 0.3531 3.7422 4.4241 5.0105 0.4905 0.1752 3.6269 3.7525 0.1317 2.3426 1.3322 4.3827 1.3509 3.5804 22.5793 5.3111 4.4529 2.3150 1.0718 1.4593 5.7849 11.0130 15.0445 0.1459 0.4074 12.0114 2.4915 7.4128 10.1417 11.3603 3.3972 7.9499 108.1681 5.8158 16.0517 6.8285 1.1740 2.2727 6.8831 3.6535 9.5328 40.6593 28.4673 13.2524 18.7703 17.5400 17.5432 23.3660 56.2564 1.4137 7.7979 9.2150 61.9268 19.4760 54.5918 11.5102 18.8777 11.2650 17.6054 0.2474 52.4676 7.8382 7.6542 0.5059 143.4805 67.1003 4.0853 0.0074 36.2662 54.8025 58.0208 35.5108 146.6998 324.4776 48.3107 44.2778 23.3046 0.2251 8.8885 43.6550 3.0178 12.7139 190.4077 146.3378 73.3337 44.6173 25.5796 85.7153 10.7451 213.9746 302.9139 19.4505 1.0236 9.4967 2.9126 23.1480 0.4830 69.3341 9.0365 23.3656 15.4066 8.3933 11.9679 26.5465 22.8106 35.2259 6.8720 30.0172 11.6881 26.3717 3.5565 5.1273 4.0984 18.8513 40.6021 16.9477 79.6670 38.6635 323.4846 91.9278 80.6832 201.0830 287.9314 411.2395 64.3518 10.3906 19.8428 11.1609 17.7976 9.6660 40.1372 12.0698 16.1193 10.9672 8.0290 24.2669 19.9422 16.5826 4.1233 21.2347 0.3773 6.4290 5.5714 4.8414 2.2433 54.7941
temp: 298.150 k
press: 1.00000 atm
elementType: 8 8 8 8 8 8 8 7 7 7 7 6 6 6 6 6 6 6 6 6 6 6 6 6 6 6 6 6 6 6 6 6 1 1 1 1 1 1 1 1 1 1 1 1 1 1 1 1 1 1 1 1 1 1
symmnumber: 1
zpe: 1081225.9 jmol-1
zpe.correction: 0.411817 hartree
zpe.thermalcorrener: 0.439839 hartree
zpe.thermalcorrenthalpy: 0.440783 hartree
zpe.thermalcorrgfe: 0.350632 hartree
zpe.sumelectzpe: -1556.628763 hartree
zpe.sumelectthermal: -1556.600741 hartree
zpe.sumelectthermalent: -1556.599797 hartree
zpe.sumelectthermalfe: -1556.689948 hartree
dipole: -5.8775 10.4192 2.5284
dipole: 12.2270
quadrupole: -160.8336 -231.9802 -182.3872
quadrupole: 70.2690 -11.2465 -1.5983
quadrupole: 30.9001 -40.2465 9.3464 70.2690 -11.2465 -1.5983
hfenergy: -1557.0405802 hartree
pointgroup: C01 [X(C21H22N4O7)]
dipole: 2.8608847 -1.4912132 3.5682081 debye
polarizability: 344.1554265|55.7685446|258.3312821|-16.6513001|-48.3071867|256.4805883 unknown
InChI: InChI=1S/C21H22N4O7/c1-21(2)31-15-13(8-29-20(27)11-4-6-12(28-3)7-5-11)30-19(16(15)32-21)25-10-24-14-17(25)22-9-23-18(14)26/h4-7,9-10,13,15-16,19,22H,8H2,1-3H3
charge 0 multiplicity 1
54 atoms
O  -0.859814 0.243931 1.305093
O  -2.457038 -2.744123 1.381089
O  -0.144412 -2.773526 1.885802
O  2.645478 0.231831 0.926851
O  -5.143529 1.924295 -4.013183
O  2.756018 -1.735693 -0.314797
O  7.825548 1.568742 -2.625732
N  -2.565849 0.433657 -0.388627
N  -2.721387 2.014581 -2.036945
N  -4.6757 -0.824535 -0.912975
N  -5.912906 0.047889 -2.801272
C  -1.816582 -1.821941 0.451094
C  -0.28166 -2.000596 0.637432
C  -2.094872 -0.316994 0.803486
C  0.276401 -0.566989 0.738856
C  -1.480767 -3.045113 2.482373
C  1.497667 -0.369531 1.648093
C  -1.587444 -4.532614 2.800627
C  -1.713642 -2.12257 3.686743
C  -3.728239 0.170768 -1.101699
C  -1.996256 1.57936 -0.998709
C  -3.823795 1.140031 -2.121941
C  -4.955583 1.12562 -3.06294
C  3.236081 -0.601807 -0.045113
C  -5.753142 -0.809946 -1.822379
C  4.422713 0.014043 -0.673853
C  5.120706 -0.72285 -1.67349
C  4.88165 1.30825 -0.318307
C  6.248149 -0.178663 -2.300367
C  6.012479 1.866759 -0.9435
C  6.698577 1.120624 -1.93912
C  8.337846 2.909826 -2.315176
H  -2.163703 -2.077831 -0.562602
H  0.21995 -2.562972 -0.164141
H  -2.852555 -0.234361 1.604332
H  0.493449 -0.193944 -0.281744
H  1.801234 -1.328519 2.098128
H  1.259771 0.365296 2.431425
H  -1.418551 -5.125173 1.887734
H  -0.828829 -4.810383 3.551484
H  -2.587467 -4.766659 3.204089
H  -1.007343 -2.385831 4.492881
H  -1.544611 -1.066757 3.416118
H  -2.742235 -2.245472 4.067601
H  -1.086258 2.029928 -0.613943
H  -4.622292 -1.525497 -0.169141
H  -6.496462 -1.600626 -1.659226
H  4.758877 -1.720934 -1.940476
H  4.344598 1.872085 0.449341
H  6.797957 -0.727586 -3.070132
H  6.34737 2.867508 -0.65691
H  8.654086 2.981147 -1.257191
H  7.580976 3.686238 -2.535618
H  9.208242 3.040528 -2.973625
