program: Gaussian 09
title: 000282323
version: EM64L-G09RevD.01
frameworkgroup: C1[X(C29H27O3P)]
method: RPBEPBE
basis: SDD
operation: Freq
keyword: #p
keyword: freq=noraman
keyword: PBEPBE/SDD
title: #p freq=noraman PBEPBE/SDD
converged: YES YES NO NO
title: Mulliken charges:
elementType: P O O O C C C C C C C C C C C C C C C C C C C C C C C C C C C C C H H H H H H H H H H H H H H H H H H H H H H H H H H H
charge: 0.944878 -0.295461 -0.671680 -0.194078 0.149097 -0.506559 -0.739254 0.420748 -0.082803 -0.073113 0.040451 -0.421455 -0.347809 0.329256 -0.307223 -0.250392 -0.254177 -0.306845 -0.561821 -0.265399 -0.237300 -0.211465 -0.244951 -0.234519 -0.208653 -0.366332 -0.360150 -0.239749 -0.226613 -0.223729 -0.232013 -0.258833 -0.227364 0.246375 0.265282 0.312574 0.247801 0.241082 0.283388 0.297617 0.221828 0.224894 0.289892 0.258417 0.224545 0.242175 0.225664 0.228190 0.234377 0.232795 0.231458 0.234928 0.269217 0.261100 0.229328 0.232223 0.233169 0.233498 0.230705 0.232785
chargesum: 0.00000
title: Mulliken charges with hydrogens summed into heavy atoms:
elementType: P O O O C C C C C C C C C C C C C C C C C C C C C C C C C C C C C
charge: 0.944878 -0.295461 -0.671680 -0.194078 0.149097 0.005098 -0.178879 0.420748 -0.082803 -0.073113 0.040451 -0.180373 -0.064421 0.329256 -0.009606 -0.028564 -0.029283 -0.016953 0.163316 -0.039735 -0.009109 0.022913 -0.012156 -0.003062 0.026275 -0.097114 -0.099049 -0.010421 0.005610 0.009441 0.001485 -0.028128 0.005421
polarizability: 3.09513482e+02 -3.64327500e+01 3.62236698e+02 1.06442658e+00 -5.03672171e+00 3.33304131e+02
1716.lowfreq: -8.9582 0.0009 0.0011 0.0011 2.9414 6.2849 9.5480 16.3389 25.4053
frequency: 8.3425 16.0455 25.3707 28.7644 31.7190 38.0806 45.1388 53.1145 60.0919 80.1104 83.4006 91.9568 112.7674 140.7091 150.3679 162.9652 169.2528 176.8020 185.0997 195.3460 216.7389 226.3570 237.9354 247.7200 271.6202 284.4710 310.5027 322.9159 362.9203 370.3943 381.4240 385.2959 396.3192 399.3422 400.6780 407.5467 415.1949 430.8932 453.9327 488.6404 504.1622 513.0076 551.8367 572.1446 611.0469 611.8749 613.8688 616.8680 646.5269 665.8048 686.5260 690.5455 693.8611 701.8040 702.5595 703.4203 709.1677 713.9642 756.1142 756.7559 767.5667 776.3643 794.9025 839.4085 856.9146 857.7826 857.9900 863.8963 872.1090 926.9702 930.6997 936.4237 938.7130 942.9349 976.5511 978.9758 982.8790 984.1338 984.2093 986.4471 987.3231 989.9482 990.3532 992.1394 998.4866 1002.4782 1005.7923 1008.6321 1013.3259 1019.9417 1021.2216 1025.3757 1035.2330 1041.5594 1062.1362 1074.3741 1082.5752 1086.3748 1087.9911 1090.8688 1099.0033 1118.1794 1149.6047 1160.7409 1173.3198 1173.6920 1174.3554 1174.5273 1186.5330 1189.7259 1190.6030 1194.3607 1212.5961 1228.4480 1235.0856 1293.3709 1307.7224 1312.2409 1319.3976 1321.2625 1362.2066 1377.3287 1379.8716 1381.0930 1381.8206 1423.9000 1426.4878 1430.9918 1432.2782 1434.9211 1437.4244 1464.9318 1465.6696 1467.2296 1475.4667 1482.1192 1491.8825 1497.3138 1562.4280 1586.2773 1588.8314 1589.1951 1589.5509 1595.2929 1597.1884 1607.1972 1610.4449 2961.1656 2993.1621 3017.4048 3067.8773 3069.7657 3090.5713 3110.0262 3118.9373 3119.5206 3122.2502 3128.5044 3128.6201 3130.2717 3130.3335 3137.5682 3139.8626 3140.2197 3141.7840 3149.4281 3151.1795 3154.0241 3157.3999 3164.6748 3165.8441 3165.9661 3171.5591 3176.7143
redmass: 5.7819 5.7292 4.6711 4.0073 5.4487 4.7230 4.2604 4.2629 5.1379 4.3348 5.4527 5.3024 4.9193 5.1206 2.9717 5.0565 1.8663 4.0408 4.4158 5.7111 2.2587 4.8705 4.2868 3.4142 6.5119 4.1109 3.3728 4.2117 7.9045 3.6649 5.6759 5.6117 2.8049 2.9183 2.9402 2.9306 3.9593 4.2078 4.0306 4.2437 4.3491 4.1152 4.8314 4.9193 6.4558 6.4289 6.4314 6.4110 6.3481 5.8937 6.0167 5.6360 5.4687 1.8677 1.8436 2.0404 1.7177 1.9929 1.6832 1.8685 1.7956 2.2322 2.2083 3.3918 1.2617 1.2531 1.2567 1.2466 3.1640 1.5237 1.3825 1.4085 1.4596 4.7958 2.4376 2.2672 2.6095 1.4826 1.5207 3.3978 1.7599 5.7292 5.7853 4.4411 1.3789 1.3788 1.3340 1.3269 3.8967 3.0016 2.9404 2.4842 2.1279 2.6624 2.8693 1.6519 1.6629 2.6644 1.6030 2.7754 1.8878 1.2529 1.5246 1.3566 1.0567 1.0519 1.0546 1.0560 1.1261 1.1369 1.1326 1.1266 2.2605 2.9611 1.4005 1.3359 1.3337 1.3233 1.3344 1.3341 1.2901 8.2209 8.2778 6.9039 8.0648 2.0880 2.0897 1.1558 2.0603 2.1759 1.1318 1.8137 1.1678 2.0336 2.1475 2.1419 1.0557 1.0721 8.4914 6.0592 6.6509 6.0893 6.0579 5.8338 5.8261 6.0276 6.1048 1.0362 1.0671 1.0575 1.0975 1.0957 1.1025 1.1023 1.0849 1.0865 1.0859 1.0853 1.0871 1.0873 1.0876 1.0918 1.0918 1.0891 1.0935 1.0961 1.0963 1.0937 1.0972 1.1015 1.0977 1.1012 1.0980 1.0964
irintensity: 0.2812 0.0728 0.5792 0.5886 0.2903 0.2120 0.4933 0.1582 0.1130 0.0539 0.4488 1.0202 2.4636 1.0418 1.5359 2.7931 6.0055 3.9639 5.4677 11.9492 3.3243 4.0680 2.7692 6.0530 3.2836 1.5785 15.3318 0.1325 4.1611 1.1449 18.2278 18.2812 0.3262 0.7980 2.2866 1.5941 9.3337 14.0961 4.1424 6.8095 54.1240 79.3662 26.0829 6.2951 0.0292 0.1557 0.0306 0.0695 19.9424 9.7058 6.2683 7.6429 9.0229 37.1302 67.9751 40.9915 63.1924 68.1305 21.4267 99.7082 15.4285 11.8371 30.6386 42.5339 2.8022 0.9858 0.1706 0.2315 15.0546 6.7269 0.4118 1.4128 0.8786 14.1566 42.2714 28.8423 8.6103 4.1102 6.6394 1.9240 3.3669 7.5598 8.2508 0.6541 1.5389 1.7179 0.2505 0.4493 25.7244 2.5513 1.7015 4.7766 5.1768 21.6666 16.7114 8.7096 7.5047 29.7059 7.1494 29.6479 3.8556 2.5336 17.2881 8.9898 0.2569 0.1665 0.1336 0.1026 5.3784 27.7265 10.7555 8.3201 122.3579 75.2976 9.6187 2.6011 0.9511 8.5048 1.3688 1.0365 6.0565 1.0460 0.5649 1.5324 1.1143 2.0783 27.4654 18.5746 4.8504 12.0934 10.5071 6.0683 18.9396 5.0308 0.6805 16.8309 9.3688 10.3678 100.1944 0.1455 17.8737 0.7417 0.3080 1.0042 0.6585 8.6181 4.0304 37.9037 11.7801 24.0749 22.2395 4.2261 7.0942 20.3672 6.7828 7.8672 2.7233 0.2332 3.2103 2.5416 5.5946 4.5064 7.2474 10.5921 39.1443 17.5901 24.6937 13.9919 23.4934 37.7158 35.1465 18.6921 9.6680 10.1159
temp: 298.150 k
press: 1.00000 atm
elementType: 15 8 8 8 6 6 6 6 6 6 6 6 6 6 6 6 6 6 6 6 6 6 6 6 6 6 6 6 6 6 6 6 6 1 1 1 1 1 1 1 1 1 1 1 1 1 1 1 1 1 1 1 1 1 1 1 1 1 1 1
symmnumber: 1
zpe: 1250808.8 jmol-1
zpe.correction: 0.476408 hartree
zpe.thermalcorrener: 0.506739 hartree
zpe.thermalcorrenthalpy: 0.507683 hartree
zpe.thermalcorrgfe: 0.410857 hartree
zpe.sumelectzpe: -1685.815892 hartree
zpe.sumelectthermal: -1685.785561 hartree
zpe.sumelectthermalent: -1685.784617 hartree
zpe.sumelectthermalfe: -1685.881444 hartree
dipole: 1.9070 2.1393 5.6151
dipole: 6.3042
quadrupole: -191.2313 -184.0146 -191.7580
quadrupole: -16.2154 -0.2663 -1.9187
quadrupole: -2.2300 4.9867 -2.7567 -16.2154 -0.2663 -1.9187
hfenergy: -1686.2923002 hartree
pointgroup: C01 [X(C29H27O3P1)]
dipole: -0.6545274 0.6728619 -2.2957725 debye
polarizability: 314.8105992|39.5911075|357.7540509|-2.7261939|3.2041836|332.4896598 unknown
InChI: InChI=1S/C29H27O3P/c1-32-29(25-16-8-3-9-17-25,28(30)24-14-6-2-7-15-24)22-23-33(31,26-18-10-4-11-19-26)27-20-12-5-13-21-27/h2-21H,22-23H2,1H3
charge 0 multiplicity 1
60 atoms
P  -2.240358 0.527099 0.656515
O  0.952814 -2.069691 1.801081
O  -2.006019 1.053486 2.175636
O  3.358447 -1.020602 2.477101
C  1.546828 -1.138873 0.821344
C  0.516824 -0.02638 0.462236
C  -0.859189 -0.618993 0.078715
C  1.951298 -2.059546 -0.34681
C  -2.275899 1.975589 -0.536738
C  -3.842799 -0.420524 0.471375
C  2.868177 -0.51513 1.429281
C  1.658668 -1.775531 -1.703454
C  2.657359 -3.250125 -0.033401
C  3.527272 0.693472 0.81666
C  -2.053765 3.25466 0.02362
C  -4.114938 -1.263112 -0.632197
C  -2.499986 1.829293 -1.925524
C  -4.790162 -0.272351 1.511241
C  0.490977 -1.496151 3.085794
C  2.05847 -2.663431 -2.727329
C  3.058986 -4.135799 -1.055338
C  -2.052551 4.393891 -0.812952
C  -5.348218 -1.950179 -0.700317
C  -2.49652 2.971234 -2.758637
C  -6.022075 -0.960092 1.43766
C  4.243367 1.5499 1.699312
C  3.515408 0.994059 -0.572175
C  2.761775 -3.84663 -2.408072
C  -2.272034 4.253172 -2.203066
C  -6.303428 -1.795614 0.33141
C  4.908347 2.691714 1.211299
C  4.199847 2.127044 -1.061831
C  4.888342 2.984782 -0.173403
H  0.90074 0.628607 -0.336935
H  0.393183 0.620298 1.353523
H  -1.010278 -1.582588 0.598233
H  -0.962444 -0.792092 -1.005892
H  1.112143 -0.865553 -1.976174
H  2.869062 -3.473587 1.016521
H  -1.889566 3.332177 1.105084
H  -3.374339 -1.40717 -1.428234
H  -2.689564 0.842524 -2.36524
H  -4.541711 0.36575 2.367295
H  -0.295861 -0.728133 2.947621
H  0.068125 -2.358565 3.62514
H  1.337545 -1.083116 3.660497
H  1.819887 -2.431352 -3.771608
H  3.603263 -5.051093 -0.797243
H  -1.881424 5.386565 -0.382181
H  -5.560218 -2.607057 -1.551011
H  -2.672943 2.862666 -3.834538
H  -6.757763 -0.847978 2.241546
H  4.26605 1.296996 2.764314
H  3.023491 0.320227 -1.278029
H  3.073915 -4.534394 -3.201991
H  -2.271673 5.137257 -2.85064
H  -7.258623 -2.329743 0.276623
H  5.444336 3.349589 1.90404
H  4.200841 2.337242 -2.136984
H  5.411166 3.86838 -0.556371
