program: Gaussian 09
title: 000282191
version: EM64L-G09RevD.01
frameworkgroup: C1[X(C13H14ClNO2)]
method: RPBEPBE
basis: SDD
operation: Freq
keyword: #p
keyword: freq=noraman
keyword: PBEPBE/SDD
title: #p freq=noraman PBEPBE/SDD
converged: YES YES NO NO
title: Mulliken charges:
elementType: Cl O O N C C C C C C C C C C C C C H H H H H H H H H H H H H H
charge: -0.018384 -0.158506 -0.226768 -0.222559 -0.416119 -0.385322 -0.364860 -0.390194 -0.505431 0.241957 0.141056 0.338232 -0.315050 -0.353202 -0.234148 -0.224528 -0.223956 0.224601 0.201726 0.215254 0.238124 0.244769 0.245150 0.213497 0.264951 0.270732 0.240936 0.261684 0.231872 0.231961 0.232522
chargesum: 0.00000
title: Mulliken charges with hydrogens summed into heavy atoms:
elementType: Cl O O N C C C C C C C C C C C C C
charge: -0.018384 -0.158506 -0.226768 -0.222559 0.010208 0.068056 0.125059 0.088254 -0.234699 0.241957 0.141056 0.338232 -0.074114 -0.091518 -0.002276 0.007433 0.008566
polarizability: 2.00575784e+02 1.49753914e+01 1.70352528e+02 -1.26654550e+01 8.68056261e+00 1.05042757e+02
1716.lowfreq: -8.5196 -0.0021 -0.0017 -0.0004 8.0266 11.4646 30.8014 42.2764 48.2763
frequency: 30.6626 42.2606 48.2699 101.4637 116.9970 129.8863 174.2347 180.2576 228.1032 247.1063 260.0178 282.7611 313.6781 334.8702 382.6943 403.2841 413.3271 423.8800 478.6554 524.2187 550.9805 613.6490 626.9248 688.0421 691.1490 702.0437 725.0697 757.1161 770.7721 791.6324 841.3649 853.1849 868.2281 885.5944 934.7401 942.6801 962.0053 982.3460 990.6605 1001.4788 1003.5707 1030.5584 1039.8476 1086.0723 1089.7066 1104.4408 1130.2795 1161.7660 1164.6585 1174.8051 1190.2322 1220.2349 1238.4824 1250.7624 1257.1609 1296.7353 1318.8032 1324.2845 1332.8225 1350.6405 1357.5538 1384.0071 1387.3193 1436.3701 1453.9199 1458.4195 1466.5754 1469.6062 1479.1387 1572.5240 1596.6015 1609.9773 1622.5137 2971.4747 2990.7547 2994.4619 3008.1113 3040.3852 3054.9430 3056.0223 3077.4949 3091.9850 3130.8227 3140.1297 3150.9253 3161.5329 3172.0338
redmass: 7.1718 5.4534 4.3511 5.1424 5.5657 3.7329 5.4268 5.2713 5.4288 5.4190 3.0127 3.1202 6.9495 5.0549 2.4650 2.8173 4.5083 4.3721 2.0385 5.3066 3.5671 6.4358 6.9225 4.4247 4.4230 1.7144 3.7810 3.4151 2.8198 2.4150 2.2705 1.2488 1.9471 3.2807 1.6592 2.1074 2.4219 1.4098 5.8636 1.4053 3.0961 2.1248 2.0184 1.9819 1.9376 2.3398 1.9821 2.3860 1.6697 1.0555 1.1208 1.3228 1.5403 1.3848 2.3250 1.3434 1.3164 1.3963 1.3343 1.5006 1.3843 1.3483 8.3028 2.2627 1.0891 1.0963 1.0846 1.0878 2.2326 8.0015 7.1549 6.1409 10.9004 1.0641 1.0673 1.0627 1.0621 1.0955 1.1009 1.0882 1.1022 1.0949 1.0851 1.0882 1.0927 1.0966 1.1013
irintensity: 1.6693 4.9741 1.5104 1.2389 1.0471 2.1493 4.8147 1.3288 0.5990 0.9003 0.9428 3.9319 5.1252 1.1409 3.1487 0.2371 8.1385 3.3459 1.5903 4.2774 2.7380 0.0853 36.8455 15.3748 4.5344 57.4974 34.6182 15.8939 3.3410 29.4145 26.6928 2.1925 6.8902 7.5347 3.8500 1.4310 125.1849 0.7633 1.0270 0.2768 12.8344 1.6600 6.5443 44.1205 5.2557 62.0265 80.1735 116.9606 34.3605 0.1668 7.7233 26.1956 43.6777 93.8770 175.4558 22.5777 1.0147 70.7231 1.2143 0.8889 4.4848 36.5249 1.4500 15.0568 32.4935 8.4940 29.4117 10.3568 3.8948 111.1029 50.0965 8.0483 177.6286 33.3749 22.2337 27.5242 8.1660 42.8802 37.5080 5.9299 27.8886 4.0296 0.3000 3.7259 21.7807 20.8502 16.5255
temp: 298.150 k
press: 1.00000 atm
elementType: 17 8 8 7 6 6 6 6 6 6 6 6 6 6 6 6 6 1 1 1 1 1 1 1 1 1 1 1 1 1 1
symmnumber: 1
zpe: 642381.2 jmol-1
zpe.correction: 0.244670 hartree
zpe.thermalcorrener: 0.259894 hartree
zpe.thermalcorrenthalpy: 0.260839 hartree
zpe.thermalcorrgfe: 0.200974 hartree
zpe.sumelectzpe: -1167.806002 hartree
zpe.sumelectthermal: -1167.790778 hartree
zpe.sumelectthermalent: -1167.789834 hartree
zpe.sumelectthermalfe: -1167.849699 hartree
dipole: -1.8741 -1.2695 2.1752
dipole: 3.1393
quadrupole: -86.5820 -116.2542 -105.7886
quadrupole: 13.0726 -2.8924 4.8370
quadrupole: 16.2929 -13.3793 -2.9136 13.0726 -2.8924 4.8370
hfenergy: -1168.0506725 hartree
pointgroup: C01 [X(C13H14Cl1N1O2)]
dipole: -0.7711096 -0.6126352 0.7453594 debye
polarizability: 203.2515851|14.0841416|157.4643207|-11.1745923|24.1684239|115.2551641 unknown
InChI: InChI=1S/C13H14ClNO2/c14-11-8-4-5-9-15(13(11)17)12(16)10-6-2-1-3-7-10/h1-3,6-7,11H,4-5,8-9H2
charge 0 multiplicity 1
31 atoms
Cl -2.060842 3.114324 0.799271
O  -0.286411 1.445406 -0.950485
O  0.442168 -2.466348 -0.836689
N  -0.743384 -0.643114 0.03116
C  -4.087436 -0.409739 -0.23902
C  -3.072475 -1.539254 -0.532772
C  -3.540069 1.033919 -0.375732
C  -1.852773 -1.570857 0.419553
C  -2.278878 1.266691 0.483673
C  -1.002109 0.736138 -0.20396
C  0.47668 -1.26944 -0.432413
C  1.762645 -0.520361 -0.309993
C  1.999998 0.417256 0.728322
C  2.812728 -0.860227 -1.201539
C  3.268228 1.016846 0.861342
C  4.074711 -0.245405 -1.077746
C  4.305581 0.695002 -0.045786
H  -4.954979 -0.514143 -0.917759
H  -4.47722 -0.544696 0.791415
H  -3.597457 -2.508743 -0.434993
H  -2.708039 -1.48354 -1.576365
H  -3.305305 1.276914 -1.428534
H  -4.318968 1.74267 -0.042762
H  -2.164158 -1.352964 1.460127
H  -1.406043 -2.577107 0.400835
H  -2.403327 0.840366 1.492827
H  1.204307 0.666839 1.437966
H  2.621737 -1.605183 -1.980697
H  3.447909 1.735799 1.667703
H  4.876922 -0.499459 -1.778799
H  5.287564 1.170812 0.054048
