program: Gaussian 09
title: 000282203
version: EM64L-G09RevD.01
frameworkgroup: C1[X(C13H23NO2S)]
method: RPBEPBE
basis: SDD
operation: Freq
keyword: #p
keyword: freq=noraman
keyword: PBEPBE/SDD
title: #p freq=noraman PBEPBE/SDD
converged: YES YES NO NO
title: Mulliken charges:
elementType: S O O N C C C C C C C C C C C C C H H H H H H H H H H H H H H H H H H H H H H H
charge: 0.935637 -0.574017 -0.552734 -0.121305 -0.101170 -0.521433 0.075479 -0.069943 -0.500543 -0.726000 -0.742267 -0.194080 -0.201400 -0.355613 -0.333871 -0.660981 -0.670271 0.288846 0.306488 0.254198 0.227415 0.232144 0.238703 0.260985 0.223773 0.220213 0.235628 0.270806 0.221697 0.210185 0.208570 0.193276 0.207344 0.197401 0.232619 0.235034 0.198883 0.239255 0.209549 0.201501
chargesum: 0.00000
title: Mulliken charges with hydrogens summed into heavy atoms:
elementType: S O O N C C C C C C C C C C C C C
charge: 0.935637 -0.574017 -0.552734 -0.121305 0.187676 -0.214945 0.075479 0.184255 -0.040984 -0.002540 -0.015620 0.027617 0.008785 0.046234 0.070874 0.005554 -0.019965
polarizability: 1.99955650e+02 1.32748527e+01 1.82673120e+02 3.79241819e+00 -1.23186570e+00 1.53657195e+02
1716.lowfreq: -7.2939 -0.0010 0.0008 0.0008 7.3150 14.6894 34.9547 43.9948 50.3815
frequency: 34.7500 43.7522 50.3269 72.0930 91.2756 110.2292 112.2749 123.3282 154.6272 156.9664 163.8905 181.5378 194.5904 204.4868 212.0300 243.5970 263.1952 267.8228 282.4000 313.8264 321.6946 357.5334 376.0823 384.5174 404.6159 441.0641 460.2156 488.1753 508.9692 539.3077 572.6039 627.4021 662.6510 732.0038 764.7944 783.2016 798.0323 814.1623 859.2828 884.9517 895.2104 915.1270 926.9668 939.6283 956.5285 970.5444 977.5944 983.6747 1003.9584 1041.8648 1060.3730 1072.8385 1076.2189 1083.8781 1100.0349 1103.8816 1117.5788 1131.3929 1154.5892 1169.6517 1176.3751 1211.5945 1220.2413 1236.0296 1256.3557 1270.7947 1290.1719 1294.4252 1304.9744 1340.7999 1347.9617 1353.3291 1363.7874 1366.4046 1383.3706 1386.4783 1389.1621 1396.3925 1398.1847 1450.2525 1457.5981 1459.7084 1462.8497 1467.6258 1469.2572 1473.8516 1478.5221 1480.1118 1487.9756 1488.3508 1630.6869 2871.9043 2886.4049 2962.1170 2968.4618 2973.0474 2979.5367 2981.2910 2982.7139 2992.1392 3020.8636 3024.4521 3032.4330 3048.1740 3061.4098 3064.0984 3072.9478 3076.0126 3085.2537 3091.8202 3093.1386 3094.5948 3094.9423 3125.1991
redmass: 3.6470 4.3157 3.4688 2.3088 3.8166 4.6042 3.4964 3.3397 2.0186 2.1783 1.2977 1.8000 1.7997 1.4072 1.6583 2.6140 2.3123 3.2788 2.0813 3.5333 2.4715 3.4259 3.9997 3.2366 4.4949 3.0168 5.5544 3.4304 3.0268 2.9654 3.1943 4.3012 1.5563 3.5430 1.9464 1.1484 1.4073 12.1210 3.0711 2.8864 2.1646 7.1190 2.1694 1.3587 1.6691 1.6421 1.4331 1.8779 2.0264 2.6311 2.3126 1.8948 2.0533 1.9981 1.5351 1.6855 1.5332 2.6987 1.3856 1.5941 1.6429 1.9455 1.4529 1.7148 2.9533 1.1968 1.3443 1.7025 1.3026 1.4282 1.4063 1.4023 1.4126 1.3490 1.3590 1.2241 1.3535 1.2133 1.2035 1.0540 1.0814 1.0509 1.0598 1.0727 1.0466 1.0512 1.0486 1.0567 1.0732 1.0760 6.6529 1.0715 1.0713 1.0381 1.0594 1.0419 1.0367 1.0806 1.0365 1.0825 1.0883 1.0993 1.0887 1.0965 1.0906 1.0886 1.0986 1.0987 1.0990 1.1006 1.0987 1.0872 1.0973 1.0984
irintensity: 0.9270 2.7526 1.0517 0.2007 3.3536 0.2437 3.0408 4.7269 8.7159 0.2642 0.8801 0.5111 3.7492 0.3205 0.3025 6.1653 5.1280 4.2673 2.2937 2.1690 1.9553 4.8879 21.7815 0.9685 7.2998 2.8449 32.4034 1.1532 1.3319 12.0457 7.1863 6.3218 31.0685 0.2365 6.7300 4.7394 18.0907 66.1242 3.8942 0.9484 5.4240 64.5801 5.7763 2.4466 2.3384 0.9068 3.2693 1.0434 5.4902 5.7976 41.8918 11.2423 9.7183 0.1958 12.9466 20.6936 11.6821 29.9341 14.6877 12.1647 28.7702 34.1800 6.6938 6.0510 24.8746 0.6265 13.4494 8.0708 28.5278 2.3192 9.1791 14.3564 3.8813 4.1831 26.6179 6.9421 35.2979 22.0184 10.2412 6.7501 7.3280 5.2072 10.4480 5.5659 8.3701 2.5599 4.5916 15.2502 16.3622 11.1940 13.4339 66.7974 109.3188 17.6828 14.4197 38.7458 36.3537 2.1201 27.2488 4.6836 18.2201 23.2875 26.2684 5.5602 4.4265 7.3815 42.5289 62.2750 10.6938 40.7674 19.1577 15.8413 22.3730 46.1273
temp: 298.150 k
press: 1.00000 atm
elementType: 16 8 8 7 6 6 6 6 6 6 6 6 6 6 6 6 6 1 1 1 1 1 1 1 1 1 1 1 1 1 1 1 1 1 1 1 1 1 1 1
symmnumber: 1
zpe: 885932.7 jmol-1
zpe.correction: 0.337434 hartree
zpe.thermalcorrener: 0.357717 hartree
zpe.thermalcorrenthalpy: 0.358661 hartree
zpe.thermalcorrgfe: 0.289012 hartree
zpe.sumelectzpe: -1110.887730 hartree
zpe.sumelectthermal: -1110.867447 hartree
zpe.sumelectthermalent: -1110.866503 hartree
zpe.sumelectthermalfe: -1110.936152 hartree
dipole: 0.6168 7.1264 0.1732
dipole: 7.1551
quadrupole: -95.6898 -123.8550 -116.6637
quadrupole: 6.1263 1.9602 1.1113
quadrupole: 16.3797 -11.7855 -4.5942 6.1263 1.9602 1.1113
hfenergy: -1111.2251642 hartree
pointgroup: C01 [X(C13H23N1O2S1)]
dipole: -0.2113261 -2.5701466 1.1288039 debye
polarizability: 199.8710051|11.6903952|179.9070473|-6.840046|-9.2171958|156.5079119 unknown
InChI: InChI=1S/C13H23NO2S/c1-5-14(6-2)11-9-7-8-10-12(11)17(15,16)13(10,3)4/h7,9-12H,5-6,8H2,1-4H3
charge 0 multiplicity 1
40 atoms
S  -1.174971 1.397941 -0.523375
O  -0.981509 1.392085 -2.156642
O  -1.099337 2.793016 0.324171
N  2.244554 0.039401 0.084782
C  -1.476832 -1.032765 -0.055547
C  -0.244359 -0.160983 0.260917
C  -2.65553 -0.026978 0.026421
C  1.042676 -0.722446 -0.307639
C  -1.40548 -2.316576 0.79825
C  -3.14972 0.375627 1.408106
C  -3.707548 -0.132269 -1.061846
C  1.058743 -2.214032 0.123131
C  0.001403 -2.897039 0.647477
C  3.315351 0.074334 -0.942822
C  2.70022 -0.0904 1.490184
C  3.015712 1.073678 -2.079179
C  3.207136 1.25041 2.059762
H  -1.39112 -1.338541 -1.117923
H  -0.167662 0.120115 1.325677
H  0.978851 -0.673246 -1.414252
H  -2.156929 -3.058945 0.465464
H  -1.623917 -2.103484 1.864936
H  -2.343073 0.420552 2.159631
H  -3.628058 1.370409 1.377082
H  -3.909296 -0.350632 1.761347
H  -4.200137 -1.125109 -1.022876
H  -4.489701 0.638676 -0.950907
H  -3.24743 -0.019426 -2.061768
H  2.03267 -2.715089 0.027651
H  0.141846 -3.939028 0.96634
H  4.253145 0.373869 -0.439675
H  3.504162 -0.940648 -1.372183
H  1.848421 -0.444469 2.101286
H  3.495881 -0.866251 1.598629
H  2.94617 2.098197 -1.675451
H  2.05528 0.855115 -2.58016
H  3.814929 1.04255 -2.843805
H  2.406028 2.008715 2.020075
H  4.063492 1.635585 1.476713
H  3.539436 1.130684 3.108517
