program: Gaussian 09
title: 000282182
version: EM64L-G09RevD.01
frameworkgroup: C1[X(C9H18N2)]
method: RPBEPBE
basis: SDD
operation: Freq
keyword: #pfreq=noraman
keyword: PBEPBE/SDD
title: #p freq=noraman PBEPBE/SDD
converged: NO YES NO NO
title: Mulliken charges:
elementType: N N C C C C C C C C C H H H H H H H H H H H H H H H H H H
charge: -0.063847 -0.052975 -0.076646 -0.103423 -0.498246 -0.511152 -0.400752 -0.368751 -0.383673 -0.656210 -0.627702 0.220306 0.202254 0.212193 0.226539 0.235806 0.221249 0.218105 0.169872 0.213771 0.163756 0.190238 0.199397 0.225654 0.228645 0.189128 0.183482 0.222124 0.220859
chargesum: 0.00000
title: Mulliken charges with hydrogens summed into heavy atoms:
elementType: N N C C C C C C C C C
charge: -0.063847 -0.052975 0.143660 0.098831 -0.059513 -0.054096 -0.012776 0.008776 0.005961 -0.012783 -0.001238
polarizability: 1.16405970e+02 3.53996551e-01 1.04871581e+02 -8.93674490e-01 -8.30024254e-01 9.51800774e+01
1716.lowfreq: -20.2673 -11.9271 -0.0007 -0.0005 -0.0003 13.4311 69.5725 142.8309 160.0524
frequency: 69.4880 142.7932 159.9389 186.7379 202.9647 230.4434 266.1234 299.4755 305.9670 353.8891 356.6435 385.2787 431.3900 519.3189 615.3344 669.4359 680.6429 737.4525 783.4610 808.0772 822.4033 870.7384 899.1890 915.3893 968.4606 974.8449 1009.1086 1017.6784 1041.7317 1059.1975 1084.8765 1096.9193 1106.7103 1119.9864 1125.5245 1142.4808 1162.4330 1168.4483 1204.3792 1220.5735 1233.3046 1249.7257 1263.7984 1272.3389 1288.4357 1294.4255 1310.7024 1329.9032 1356.0813 1360.7064 1367.7903 1384.2426 1431.2101 1433.0001 1433.7533 1458.8230 1466.0505 1468.2489 1471.8290 1478.5279 1481.4243 1487.4725 1498.2012 2802.8466 2828.3905 2855.6303 2860.5284 2969.1528 2974.6410 2996.8000 3001.5349 3006.1270 3012.0052 3014.5070 3019.7741 3025.9647 3050.1104 3053.4262 3064.6267 3074.6861 3076.3119
redmass: 2.8202 2.5350 2.0309 2.0132 1.0918 1.3004 2.3195 2.1614 3.1378 2.7747 2.9577 1.7523 2.4816 2.3131 3.4547 3.1052 4.3118 2.6298 2.1411 2.4073 3.0382 2.3323 2.2917 2.0444 1.7200 2.3253 2.0674 1.9920 2.1584 2.0434 1.9234 1.6781 1.3749 1.8227 1.7956 1.4738 1.7257 1.6464 1.4263 1.2553 1.6025 1.5033 1.5726 1.4299 1.4406 1.5136 1.4679 1.3812 1.4808 1.3526 1.4019 1.3241 1.1411 1.1242 1.1735 1.0550 1.0655 1.0690 1.0637 1.0602 1.0942 1.0681 1.0864 1.0715 1.0597 1.0687 1.0567 1.0642 1.0853 1.0624 1.0703 1.0706 1.0826 1.0841 1.0733 1.0820 1.1011 1.0991 1.1000 1.1047 1.1006
irintensity: 0.9656 0.5296 0.0565 4.3613 0.0871 0.6322 3.7545 3.6286 0.6006 0.4010 0.6343 1.4086 0.3923 0.8681 7.8447 2.4355 11.1334 4.0449 4.9320 3.5016 5.7683 1.8848 11.7720 12.7575 4.5280 1.2588 13.2184 18.2628 21.9804 9.8351 8.1889 2.2877 4.4539 29.7060 17.2812 16.2261 11.5293 4.8132 7.0858 4.9627 10.0616 19.6220 1.2628 5.4343 4.5847 14.7656 0.2680 7.6065 3.5130 0.5690 5.1676 10.9053 4.0184 6.0114 3.3994 25.6418 9.6167 3.6046 15.1355 4.3431 17.4624 8.1081 20.0467 88.7875 157.5464 155.0523 123.4049 35.4430 31.2044 6.4047 48.3924 46.0418 79.9320 78.0684 59.7143 18.8320 3.8109 33.5252 40.1408 66.2051 37.0197
temp: 298.150 k
press: 1.00000 atm
elementType: 7 7 6 6 6 6 6 6 6 6 6 1 1 1 1 1 1 1 1 1 1 1 1 1 1 1 1 1 1
symmnumber: 1
zpe: 686195.9 jmol-1
zpe.correction: 0.261358 hartree
zpe.thermalcorrener: 0.272257 hartree
zpe.thermalcorrenthalpy: 0.273201 hartree
zpe.thermalcorrgfe: 0.225787 hartree
zpe.sumelectzpe: -462.311320 hartree
zpe.sumelectthermal: -462.300421 hartree
zpe.sumelectthermalent: -462.299477 hartree
zpe.sumelectthermalfe: -462.346891 hartree
dipole: 0.5480 0.1547 1.3248
dipole: 1.4420
quadrupole: -64.9286 -66.1221 -72.2808
quadrupole: -0.8465 -1.2744 -1.1184
quadrupole: 2.8486 1.6550 -4.5036 -0.8465 -1.2744 -1.1184
hfenergy: -462.5726783 hartree
pointgroup: C01 [X(C9H18N2)]
dipole: 0.2377787 0.0346335 0.5139066 debye
polarizability: 116.2954322|0.3439156|104.9269159|-1.7781285|-0.3656604|95.2352803 unknown
InChI: InChI=1S/C9H18N2/c1-10-6-5-8-3-4-9(7-10)11(8)2/h8-9H,3-7H2,1-2H3
charge 0 multiplicity 1
29 atoms
N  1.094058 -0.424092 -0.828825
N  -1.822207 -0.174325 -0.2233
C  1.153187 1.014227 -0.410716
C  0.510568 -1.140029 0.347503
C  1.585541 0.983199 1.095093
C  0.981345 -0.347371 1.63404
C  -0.204446 1.720421 -0.625537
C  -1.025948 -1.328288 0.248015
C  -1.405324 1.181475 0.188411
C  2.410702 -0.964484 -1.244401
C  -3.263222 -0.435307 -0.082693
H  1.90426 1.530588 -1.037956
H  0.929078 -2.164157 0.376305
H  1.223079 1.867928 1.64862
H  2.688129 0.970885 1.172254
H  1.730662 -0.928032 2.200803
H  0.131792 -0.164069 2.315309
H  -0.468593 1.646092 -1.696414
H  -0.072127 2.794329 -0.375252
H  -1.228684 -2.163144 -0.453844
H  -1.367118 -1.673846 1.262631
H  -1.205127 1.268841 1.286863
H  -2.26141 1.854036 -0.012636
H  2.780378 -0.391462 -2.113517
H  2.290063 -2.014592 -1.564932
H  3.200861 -0.935781 -0.452418
H  -3.611158 -0.507527 0.981508
H  -3.515903 -1.392776 -0.576581
H  -3.843735 0.363557 -0.578532
