program: Gaussian 09
title: 000282189
version: EM64L-G09RevD.01
frameworkgroup: C1[X(C17H12O2)]
method: RPBEPBE
basis: SDD
operation: Freq
keyword: #pfreq=noraman
keyword: PBEPBE/SDD
title: #p freq=noraman PBEPBE/SDD
converged: YES YES NO NO
title: Mulliken charges:
elementType: O O C C C C C C C C C C C C C C C C C H H H H H H H H H H H H
charge: -0.189392 -0.240296 0.168658 0.168715 0.034719 0.340125 0.340052 -0.311309 -0.311262 -0.411621 -0.362484 -0.362560 -0.411604 -0.230884 -0.240458 -0.240318 -0.230890 -0.237502 -0.237508 0.284619 0.284544 0.236003 0.276722 0.276558 0.235942 0.226890 0.228580 0.228579 0.226875 0.230258 0.230248
chargesum: 0.00000
title: Mulliken charges with hydrogens summed into heavy atoms:
elementType: O O C C C C C C C C C C C C C C C C C
charge: -0.189392 -0.240296 0.168658 0.168715 0.034719 0.340125 0.340052 -0.026690 -0.026717 -0.175618 -0.085761 -0.086002 -0.175663 -0.003995 -0.011878 -0.011739 -0.004015 -0.007244 -0.007260
polarizability: 2.97062699e+02 7.48684309e-04 1.94499652e+02 2.87620225e-03 1.47987887e+01 9.37928340e+01
1716.lowfreq: -2.2238 -0.0008 -0.0005 -0.0004 0.5511 3.5713 32.3679 45.1222 63.0551
frequency: 32.3665 45.1208 63.0548 72.3833 103.3266 151.6642 164.0125 224.4144 277.6254 289.0370 322.5784 332.9127 378.6823 403.7940 405.3261 434.1066 472.0947 508.0796 534.0845 572.1344 592.9152 609.9734 615.7089 625.8533 664.4652 697.7715 698.2851 749.8239 767.3566 801.9593 803.9671 820.9200 846.1769 846.5961 862.5058 864.9769 919.3394 920.8631 941.2797 972.6035 972.6242 988.0438 988.6460 995.8351 995.8903 1025.0149 1031.4579 1056.9237 1063.1058 1087.0057 1089.5809 1174.4978 1174.5904 1197.0886 1198.2438 1225.0308 1294.6544 1306.8352 1315.4915 1322.1966 1336.4616 1363.0544 1376.2449 1377.5135 1433.6561 1434.3642 1481.1080 1485.4539 1534.4249 1546.8049 1579.8471 1584.6309 1608.7485 1610.6268 1611.6464 3120.0245 3120.0899 3131.3189 3131.3552 3144.8050 3144.8638 3162.0868 3162.2512 3191.0059 3191.2809 3197.2816 3202.1530
redmass: 5.9345 3.6874 5.9415 5.1370 4.8719 4.6895 6.4312 6.0003 4.1178 5.6096 6.8013 5.5424 6.1502 2.8151 2.8526 4.3911 3.7828 4.4357 8.2965 3.6019 5.9507 7.0113 6.4312 6.5535 7.0449 1.7311 1.7647 2.2002 1.9461 5.8495 4.8412 4.9609 1.2528 1.2653 1.4478 1.3735 1.5037 1.4431 6.2778 1.3918 1.3882 5.0687 4.8329 1.3826 1.4076 2.9519 2.3557 3.2421 3.1235 1.6401 1.6517 1.0532 1.0523 1.1166 1.1197 4.8723 3.4501 1.7332 1.4185 1.3682 1.4275 2.7475 6.8396 6.4173 2.3028 2.3400 2.3307 2.3818 9.2737 6.4389 5.5715 6.1945 6.6692 6.0630 6.3309 1.0862 1.0862 1.0880 1.0880 1.0938 1.0938 1.0997 1.0997 1.0953 1.0952 1.0930 1.0970
irintensity: 1.8119 0.0006 1.3567 1.8271 0.3737 2.3382 0.0742 0.3492 0.3724 0.2736 5.3644 0.7197 0.2310 0.1659 0.0143 0.0235 2.7350 16.5961 3.9479 3.3966 27.4866 9.3114 0.3537 0.0475 6.8656 16.5034 83.9644 91.6299 1.7371 6.7069 48.6653 5.7354 0.7721 4.1776 0.3099 39.6778 5.6936 0.0093 37.5941 1.3133 0.9339 0.0870 0.3635 0.2153 0.8111 29.6153 0.3932 12.8152 9.9393 0.0094 8.7971 0.3594 0.0077 11.8243 0.4098 147.0965 53.0954 50.6464 9.2933 15.3226 4.8232 1.0217 0.6136 1.3781 23.9315 0.5507 19.6253 2.3338 82.2535 11.4535 1.2994 1.2938 50.2164 0.3462 9.0597 7.6441 3.5821 4.1578 0.6141 0.7007 59.6185 63.5473 5.5665 2.6334 4.7930 12.6913 0.0139
temp: 298.150 k
press: 1.00000 atm
elementType: 8 8 6 6 6 6 6 6 6 6 6 6 6 6 6 6 6 6 6 1 1 1 1 1 1 1 1 1 1 1 1
symmnumber: 1
zpe: 623110.8 jmol-1
zpe.correction: 0.237330 hartree
zpe.thermalcorrener: 0.252108 hartree
zpe.thermalcorrenthalpy: 0.253053 hartree
zpe.thermalcorrgfe: 0.194195 hartree
zpe.sumelectzpe: -804.142517 hartree
zpe.sumelectthermal: -804.127739 hartree
zpe.sumelectthermalent: -804.126795 hartree
zpe.sumelectthermalfe: -804.185653 hartree
dipole: 0.0023 2.4792 -0.4631
dipole: 2.5221
quadrupole: -88.2257 -102.7060 -112.5384
quadrupole: -0.0050 -0.0003 6.0408
quadrupole: 12.9310 -1.5493 -11.3817 -0.0050 -0.0003 6.0408
hfenergy: -804.3798471 hartree
pointgroup: C01 [X(C17H12O2)]
dipole: 0.002298 0.9088112 0.3983199 debye
polarizability: 297.0621826|-0.271241|148.8376559|0.1491647|52.2728061|139.4553473 unknown
InChI: InChI=1S/C17H12O2/c18-17-15(13-7-3-1-4-8-13)11-19-12-16(17)14-9-5-2-6-10-14/h1-12H
charge 0 multiplicity 1
31 atoms
O  0.003963 2.58036 1.013621
O  -0.002053 -1.191129 -0.745422
C  1.263544 0.648075 0.209609
C  -1.261725 0.652474 0.208679
C  -0.000309 -0.055124 -0.163701
C  2.598643 0.018014 0.015699
C  -2.598838 0.027014 0.013914
C  1.195496 1.916572 0.743583
C  -1.189376 1.920907 0.742519
C  3.634844 0.238356 0.967439
C  -2.880834 -0.786386 -1.118373
C  2.879627 -0.794449 -1.117491
C  -3.635679 0.252098 0.963861
C  4.919463 -0.313736 0.781723
C  -4.168317 -1.335213 -1.30092
C  4.165523 -1.34739 -1.29884
C  -4.921922 -0.295779 0.776868
C  5.191881 -1.107866 -0.356374
C  -5.195361 -1.090549 -0.360534
H  2.053581 2.544565 0.987918
H  -2.045717 2.55163 0.985978
H  3.423908 0.814561 1.876551
H  -2.087949 -0.993021 -1.839876
H  2.087243 -0.997088 -1.84066
H  -3.424183 0.828735 1.872561
H  5.700348 -0.138056 1.530017
H  -4.36759 -1.958629 -2.179568
H  4.364145 -1.970119 -2.178128
H  -5.703371 -0.11639 1.523696
H  6.187125 -1.543055 -0.500211
H  -6.191911 -1.522483 -0.505139
