program: Gaussian 09
title: 000282175
version: EM64L-G09RevD.01
frameworkgroup: C1[X(C8H12O3)]
method: RPBEPBE
basis: SDD
operation: Freq
keyword: #pfreq=noraman
keyword: PBEPBE/SDD
title: #p freq=noraman PBEPBE/SDD
converged: YES YES NO NO
title: Mulliken charges:
elementType: O O O C C C C C C C C H H H H H H H H H H H H
charge: -0.227027 -0.207547 -0.212344 -0.030205 -0.468300 -0.215124 -0.525217 0.168566 -0.699294 0.236088 -0.762935 0.259164 0.247630 0.238128 0.266073 0.266559 0.242501 0.249313 0.207662 0.226679 0.245926 0.258714 0.234991
chargesum: 0.00000
title: Mulliken charges with hydrogens summed into heavy atoms:
elementType: O O O C C C C C C C C
charge: -0.227027 -0.207547 -0.212344 0.228959 0.017458 0.050949 -0.016158 0.168566 -0.015640 0.236088 -0.023303
polarizability: 1.10394757e+02 2.42379057e-01 7.98222388e+01 -3.26644925e+00 -4.40139686e+00 8.02171142e+01
1716.lowfreq: -3.5926 -0.0001 0.0004 0.0008 8.1383 20.4574 42.4613 47.6896 71.3189
frequency: 42.3485 47.5584 71.2740 82.5962 83.8874 171.1363 218.2219 243.8622 288.8793 298.7884 338.7971 431.5819 458.0137 475.5139 560.7518 618.9021 666.4460 700.4506 750.2073 813.7531 821.4278 849.0721 911.6078 916.0042 947.1023 973.4615 1000.7245 1021.6646 1080.2687 1094.5699 1116.5507 1156.2930 1174.6538 1179.9461 1217.2107 1249.5973 1278.0079 1298.7951 1310.9371 1322.5064 1364.6806 1371.6344 1390.5667 1427.8524 1442.8101 1454.3717 1470.7650 1477.7455 1478.8413 1628.7214 1696.9154 2977.3387 2983.5839 2986.3493 3025.9874 3028.9803 3040.2118 3067.9144 3076.1768 3083.1245 3095.1623 3101.7967 3122.5523
redmass: 2.9652 3.6772 4.5676 1.2771 2.4809 5.6682 1.3324 1.9589 3.0621 4.7148 2.3689 2.1739 2.5875 4.2249 4.3123 5.9952 5.3431 5.1089 3.5521 2.1120 2.2496 2.5826 2.3884 1.7973 2.1824 2.4877 1.9250 1.5852 2.0416 2.2857 2.5264 1.7474 2.0566 1.4664 1.4650 1.4591 1.4591 1.4937 1.3932 1.6555 1.4445 1.2412 1.1925 1.0964 1.0759 1.0564 1.0621 1.0691 1.0509 7.5659 12.3894 1.0553 1.0437 1.0359 1.0784 1.0960 1.0694 1.0949 1.0894 1.0995 1.1011 1.1026 1.1004
irintensity: 3.7778 3.6762 3.9026 0.6229 5.0463 6.0000 0.9769 3.3438 0.7921 2.0479 0.3453 4.8152 1.8978 6.1288 11.8731 9.4074 4.4327 1.1783 4.9550 8.7466 3.0130 8.2934 7.6792 41.6574 50.5290 15.9906 64.6829 29.3028 31.2630 84.7244 22.2608 29.4424 32.7014 21.6187 23.3439 9.2605 48.8124 9.6533 4.3417 32.3927 36.3367 63.3670 13.3797 25.0358 30.2663 18.6924 11.4621 4.3052 13.9023 103.2051 313.1764 3.6982 5.8935 24.3706 7.4849 4.3922 11.2220 9.6579 21.3269 36.5981 16.2563 26.0675 11.7850
temp: 298.150 k
press: 1.00000 atm
elementType: 8 8 8 6 6 6 6 6 6 6 6 1 1 1 1 1 1 1 1 1 1 1 1
symmnumber: 1
zpe: 490932.2 jmol-1
zpe.correction: 0.186986 hartree
zpe.thermalcorrener: 0.198889 hartree
zpe.thermalcorrenthalpy: 0.199833 hartree
zpe.thermalcorrgfe: 0.147693 hartree
zpe.sumelectzpe: -536.867535 hartree
zpe.sumelectthermal: -536.855632 hartree
zpe.sumelectthermalent: -536.854688 hartree
zpe.sumelectthermalfe: -536.906827 hartree
dipole: 3.1637 2.2734 1.4307
dipole: 4.1502
quadrupole: -75.4744 -68.8143 -64.5768
quadrupole: -13.9964 10.8347 2.0681
quadrupole: -5.8525 0.8076 5.0450 -13.9964 10.8347 2.0681
hfenergy: -537.0545207 hartree
pointgroup: C01 [X(C8H12O3)]
dipole: 1.0129962 1.1830505 0.4901612 debye
dipolederiv: -1.4633562 -0.1595954 0.2226784 0.1847545 -0.4942848 -0.0406429 0.1812496 0.0843854 -0.3337346 -0.9992758 -0.2476226 0.169183 -0.355957 -0.6997831 0.1377171 0.2904233 0.1738429 -0.4081717 -0.6138103 -0.1113509 -0.0317746 -0.1214783 -0.4043222 0.1876628 -0.0615411 0.1782597 -0.7700552 0.6656613 0.0804031 -0.0056575 0.3053312 0.3867938 -0.0181697 -0.018999 0.0131421 0.3223926 -0.0659312 0.1012652 0.0149553 0.00749 -0.0574311 0.0426051 0.0235141 -0.007088 0.0757317 0.0571947 0.0276853 0.047789 0.0591729 -0.2997485 0.0529898 0.0469812 0.0753383 0.0826672 -0.3784825 -0.2254069 0.0162208 -0.308427 -0.0640905 0.1211399 0.0906972 0.1140208 -0.1275058 1.8500924 0.25331 -0.4120369 -0.1148128 0.9769177 -0.1426728 -0.432833 -0.3289628 0.309361 0.0554451 -0.0320896 0.0407873 -0.010008 0.0686167 -0.0268808 0.0360882 0.0444144 0.0101035 1.0787165 0.3371931 0.18304 0.4010298 0.3520898 -0.2635087 0.1648839 -0.2574333 0.8702469 -0.4036785 -0.0479274 -0.2739676 -0.0386155 -0.0068409 0.0338844 -0.2604869 0.004187 -0.1994876 -0.0344313 0.0228905 0.0566515 0.0257013 0.0203862 -0.034605 0.0619381 -0.0506624 -0.0342639 0.042057 0.0149697 -0.0196218 0.0146474 0.0801713 -0.0087509 -0.015875 0.0216084 -0.1301602 0.0686489 -0.0754476 -0.0037503 -0.0938183 -0.0615762 -0.0330931 -0.0308115 -0.0624623 0.0611882 -0.0546701 0.0096882 -0.0756701 0.0058794 0.0787327 -0.0089052 -0.0738364 0.0030933 -0.0019511 0.0305564 0.0655794 -0.0383008 0.072163 -0.0030386 0.0684317 -0.0742229 0.0342991 0.0801834 0.053738 -0.0005185 0.0701109 0.0200739 0.0414898 -0.0932874 0.0216871 -0.0783347 -0.0126211 -0.0706671 -0.0182989 0.101163 -0.0657978 0.0887694 0.0229381 0.0827534 -0.0072575 0.042843 -0.0626053 0.0096991 -0.143233 0.0335722 0.0668118 0.0150806 -0.112523 -0.0143669 -0.0193619 0.0991877 0.0089129 0.0009429 0.041732 -0.1507129 0.0247208 -0.0039068 0.0496682 0.0534358 0.079058 0.0515301 -0.0253767 0.0819828 -0.0449903 -0.0073929 -0.0017709 -0.0158405 0.1142345 0.0091676 -0.0885483 0.0021333 -0.1261439 0.0107368 0.0176225 0.0224673 0.0567469 0.0749601 0.0573845 0.0236798 0.1037339 -0.0184718 0.115303 -0.0468832 0.0641232 -0.0305983 -0.0600347 unknown
polarizability: 108.8568665|6.653788|80.6984679|-2.4363354|-4.9862496|80.8787758 unknown
InChI: InChI=1S/C8H12O3/c1-5-3-7(4-6(2)9)11-8(5)10/h5,7H,3-4H2,1-2H3
charge 0 multiplicity 1
23 atoms
O  -0.818193 -1.390845 -0.245271
O  -3.02776 -1.549149 0.44511
O  2.390537 1.280904 -1.202812
C  0.120168 -0.323739 -0.722101
C  -0.780404 0.883999 -1.114939
C  -2.139569 0.631101 -0.411835
C  1.134994 -0.063486 0.402278
C  -2.108363 -0.857284 -0.020802
C  -2.410575 1.505632 0.839011
C  2.337797 0.769224 -0.051468
C  3.472086 0.926276 0.951465
H  0.640419 -0.744439 -1.597085
H  -0.904477 0.912266 -2.209994
H  -0.318418 1.837647 -0.814237
H  -2.984589 0.76387 -1.111022
H  1.498874 -1.032335 0.799174
H  0.651521 0.445718 1.261206
H  -3.352135 1.198585 1.326459
H  -1.596704 1.414792 1.5819
H  -2.494184 2.568511 0.551313
H  4.051648 -0.016481 1.002614
H  4.149995 1.734919 0.63702
H  3.089637 1.125014 1.968918
