program: Gaussian 09
title: 000282193
version: EM64L-G09RevD.01
frameworkgroup: C1[X(C9H20O6S2)]
method: RPBEPBE
basis: SDD
operation: Freq
keyword: #p
keyword: freq=noraman
keyword: PBEPBE/SDD
title: #p freq=noraman PBEPBE/SDD
converged: YES YES NO NO
title: Mulliken charges:
elementType: S S O O O O O O C C C C C C C C C H H H H H H H H H H H H H H H H H H H H
charge: 1.072241 1.072260 -0.426499 -0.426541 -0.572207 -0.497773 -0.572225 -0.497757 0.364573 -0.416907 -0.416933 -0.363966 -0.363813 -0.729190 -0.729175 -0.757588 -0.757462 0.204372 0.226010 0.225992 0.204407 0.260832 0.224824 0.224856 0.260714 0.233036 0.222978 0.221989 0.222001 0.223002 0.232960 0.352578 0.285197 0.277750 0.285216 0.277761 0.352487
chargesum: 0.00000
title: Mulliken charges with hydrogens summed into heavy atoms:
elementType: S S O O O O O O C C C C C C C C C
charge: 1.072241 1.072260 -0.426499 -0.426541 -0.572207 -0.497773 -0.572225 -0.497757 0.364573 0.013475 0.013466 0.121691 0.121756 -0.051187 -0.051211 0.157938 0.158001
polarizability: 1.99209369e+02 1.18831787e-02 1.88932061e+02 1.04810760e-03 -5.72421270e+00 1.41119158e+02
1716.lowfreq: -0.0028 -0.0028 0.0014 4.7286 7.6292 10.9971 43.2728 60.7499 66.4879
frequency: 42.9955 60.1433 66.4684 66.5747 74.8837 81.1856 97.1031 98.5637 110.8091 138.3487 146.4919 176.7870 190.3241 192.8930 209.3518 223.9223 227.1130 230.2220 235.2060 252.0858 272.1666 280.9982 295.6537 316.2888 321.7337 335.6408 340.9565 356.0539 364.5586 402.2888 409.7052 481.5816 486.1789 559.1102 573.3126 595.0647 601.5797 735.8666 755.7561 799.4657 831.8523 833.2112 868.4914 896.0317 915.1339 919.3388 921.5974 923.8254 975.1151 993.4774 1009.2937 1009.8540 1020.7043 1054.2147 1054.5436 1058.8434 1065.2699 1076.1263 1162.7628 1163.7839 1215.0168 1231.5327 1247.9559 1288.2296 1294.1359 1326.1052 1326.4173 1344.1895 1353.9173 1362.5661 1366.0173 1392.2876 1396.0917 1414.8071 1416.5473 1434.6933 1438.6841 1456.0886 1459.8111 1468.1800 1475.7909 1483.2082 1487.7993 1488.8259 1490.6714 2982.1135 2983.1653 2984.4344 2985.1843 2989.6071 2989.8963 3004.6692 3007.0211 3033.5818 3034.6044 3056.8922 3059.3239 3075.3403 3076.0989 3082.7277 3083.9773 3154.2939 3155.3615 3185.5508 3185.7368
redmass: 3.6142 6.1912 4.3775 5.3271 2.5001 2.5041 7.3443 5.4269 5.2214 2.9097 4.0767 3.4987 2.7720 2.0436 1.7113 3.4685 1.2276 1.1079 3.3055 3.4651 1.9143 2.8690 3.3033 3.2902 2.7897 5.2741 5.2512 7.2062 7.5373 3.5827 4.9812 3.6804 3.7030 3.7868 3.9960 9.2332 9.1738 2.6907 1.2409 1.3987 10.4726 11.0523 2.2413 2.2215 5.4428 4.7656 3.8294 4.1606 1.4941 1.5065 1.3281 1.3389 1.7582 1.9401 2.2139 1.8485 1.6703 1.8844 1.8751 1.8818 4.9917 1.1693 1.1116 1.1797 1.1779 1.1277 1.1334 1.4883 1.5114 1.2404 1.2517 1.2067 1.1981 1.0432 1.0435 1.0536 1.0532 1.0670 1.0697 1.0608 1.0717 1.0468 1.0548 1.0511 1.0560 1.0496 1.0576 1.0391 1.0451 1.0541 1.0570 1.0275 1.0270 1.1011 1.1004 1.1057 1.1067 1.0988 1.0988 1.1000 1.1004 1.1065 1.1067 1.1074 1.1073
irintensity: 0.0891 0.0091 0.9852 1.7724 2.5015 1.2665 0.5752 21.5533 0.2012 0.8487 19.4516 0.0193 1.2873 0.7642 0.0940 0.5878 2.6073 0.8038 14.0542 0.9981 0.0392 3.0056 5.5908 10.7797 0.0039 19.9254 30.7400 11.7968 26.5496 0.1542 16.8856 69.4427 15.6121 13.3791 14.6763 9.9990 102.9980 0.3528 10.9057 8.4196 41.0737 77.8161 26.3916 12.5699 86.3604 28.5734 0.3001 137.6917 14.3508 2.5873 35.7909 15.7523 0.0551 73.0816 89.2410 27.7600 0.2443 1.6905 0.8401 0.5192 5.8765 7.4335 0.7419 0.6308 1.8148 2.8052 19.4569 8.0086 0.0829 0.9800 0.9592 11.5023 17.0322 5.7028 0.4101 5.1469 15.6790 2.8560 0.0714 5.3666 47.1326 3.5734 14.3254 23.6112 0.7173 22.4929 13.4869 12.3374 6.5938 69.4909 36.0036 2.1002 72.5771 11.5607 11.4550 15.1448 34.5010 76.0501 1.2666 45.5083 54.8876 1.2036 58.4729 0.9729 0.2040
temp: 298.150 k
press: 1.00000 atm
elementType: 16 16 8 8 8 8 8 8 6 6 6 6 6 6 6 6 6 1 1 1 1 1 1 1 1 1 1 1 1 1 1 1 1 1 1 1 1
symmnumber: 1
zpe: 763983.4 jmol-1
zpe.correction: 0.290986 hartree
zpe.thermalcorrener: 0.313616 hartree
zpe.thermalcorrenthalpy: 0.314560 hartree
zpe.thermalcorrgfe: 0.239998 hartree
zpe.sumelectzpe: -1600.667045 hartree
zpe.sumelectthermal: -1600.644416 hartree
zpe.sumelectthermalent: -1600.643471 hartree
zpe.sumelectthermalfe: -1600.718033 hartree
dipole: -1.1389 -0.0058 0.0007
dipole: 1.1389
quadrupole: -106.2177 -143.3777 -118.5248
quadrupole: -0.0002 0.0067 -16.1702
quadrupole: 16.4891 -20.6710 4.1819 -0.0002 0.0067 -16.1702
hfenergy: -1600.9580312 hartree
pointgroup: C01 [X(C9H20O6S2)]
dipole: -0.0027309 0.4480588 -0.0007709 debye
polarizability: 189.4362429|-0.026855|199.2090743|-2.8995149|-0.1245403|140.615271 unknown
InChI: InChI=1S/C9H20O6S2/c1-5-9(6-2,7-14-16(3,10)11)8-15-17(4,12)13/h5-8H2,1-4H3
charge 0 multiplicity 1
37 atoms
S  2.208222 -1.738715 0.384143
S  -2.212064 -1.745945 -0.372823
O  1.728348 -0.037418 -0.255552
O  -1.735555 -0.041437 0.260508
O  1.044123 -2.238493 1.406285
O  3.739678 -1.736527 0.891612
O  -1.046622 -2.24767 -1.392478
O  -3.743281 -1.748542 -0.881019
C  -0.00614 1.691969 -0.001279
C  0.690746 2.553079 -1.103922
C  -0.705121 2.556327 1.097547
C  1.024443 0.799341 0.741885
C  -1.034783 0.793751 -0.740497
C  1.721147 3.582079 -0.591142
C  -1.737852 3.580705 0.580097
C  2.053621 -2.602428 -1.293483
C  -2.056559 -2.602747 1.308273
H  -0.089732 3.084159 -1.68381
H  1.194671 1.862923 -1.808039
H  -1.207554 1.8681 1.804621
H  0.073982 3.091783 1.675254
H  0.490787 0.147769 1.461663
H  1.766337 1.419427 1.2769
H  -1.778802 1.40997 -1.277041
H  -0.500052 0.141107 -1.45851
H  2.554431 3.096438 -0.052811
H  1.263701 4.327649 0.084036
H  2.159816 4.13208 -1.443406
H  -2.177678 4.133645 1.429859
H  -1.282066 4.324166 -0.098524
H  -2.570115 3.090773 0.044037
H  0.981978 -2.553204 -1.542138
H  2.689628 -2.026521 -1.978711
H  2.420959 -3.626102 -1.135179
H  -2.69423 -2.025575 1.990887
H  -2.42153 -3.627846 1.153777
H  -0.985185 -2.550173 1.557378
