program: Gaussian 09
title: 000282186
version: EM64L-G09RevD.01
frameworkgroup: C1[X(C17H17NO3)]
method: RPBEPBE
basis: SDD
operation: Freq
keyword: #p
keyword: freq=noraman
keyword: PBEPBE/SDD
title: #p freq=noraman PBEPBE/SDD
converged: YES YES NO NO
title: Mulliken charges:
elementType: O O O N C C C C C C C C C C C C C C C C C H H H H H H H H H H H H H H H H H
charge: -0.212479 -0.319419 -0.280450 -0.220068 -0.125274 -0.125891 -0.348245 -0.346995 0.334495 0.333969 -0.191642 -0.195943 -0.452526 -0.452134 -0.211280 -0.194525 -0.223653 -0.223635 0.331556 -0.244853 -0.665165 0.232498 0.232741 0.274653 0.275808 0.187558 0.189969 0.248713 0.249205 0.270473 0.260335 0.226805 0.226910 0.220729 0.237665 0.217741 0.254302 0.228054
chargesum: 0.00000
title: Mulliken charges with hydrogens summed into heavy atoms:
elementType: O O O N C C C C C C C C C C C C C C C C C
charge: -0.212479 -0.319419 -0.280450 -0.220068 0.107224 0.106850 -0.073592 -0.071187 0.334495 0.333969 -0.004084 -0.005974 -0.203814 -0.202928 0.059192 0.065810 0.003151 0.003276 0.331556 0.213541 0.034931
polarizability: 3.18499505e+02 8.27382263e-01 1.81614834e+02 1.34260284e+01 8.31524860e+00 1.11391750e+02
1716.lowfreq: -0.0003 0.0009 0.0011 0.6925 6.1515 11.0702 18.1587 34.0525 57.2119
frequency: 17.9319 33.6809 57.1647 63.4469 91.3352 98.3677 140.8144 157.6788 168.2606 211.8712 234.0536 257.7407 289.0599 320.7840 352.1233 363.7380 396.4833 426.4705 427.5687 447.0349 484.6578 522.0847 528.7823 532.2554 558.0599 616.6067 645.4586 677.6380 690.0291 718.0104 726.9006 742.2507 748.3891 769.6191 776.4469 801.7365 812.3180 822.5154 836.9078 840.1227 861.3441 875.4626 880.9339 882.4042 913.8493 923.9574 939.4697 953.6285 966.1043 977.3021 985.2525 990.5353 1014.1859 1020.0421 1055.2530 1095.5932 1096.0525 1133.4663 1151.8803 1154.4518 1165.9482 1172.4540 1174.4426 1192.0592 1201.2709 1209.9122 1230.4844 1234.8336 1247.0187 1274.4853 1279.8777 1294.1810 1295.1167 1341.3895 1358.6242 1368.7570 1390.8462 1395.7887 1404.2924 1404.7811 1442.8314 1446.5618 1453.8814 1456.1874 1462.1941 1484.8929 1603.6749 1623.6544 1627.7074 1703.5925 1718.2904 2978.9931 2993.2176 2995.1986 3033.3538 3086.6935 3088.6958 3089.1540 3095.2582 3121.1238 3122.2665 3124.5442 3127.7641 3132.3642 3144.4070 3162.4208 3170.3067 3199.9288
redmass: 4.9532 3.7873 3.1482 4.7509 6.3193 5.1723 3.0947 3.5768 4.8134 1.8058 2.1463 4.3588 3.7966 3.3892 4.2506 4.0735 3.9134 5.1347 4.8397 4.4823 4.3160 4.5438 7.2070 5.2441 3.8822 5.7448 5.3185 3.9097 6.6775 4.0553 3.9818 1.9446 2.3062 1.5453 2.6605 2.4693 1.5101 2.1681 4.8388 3.5497 4.8964 1.4825 4.5059 4.5590 4.3329 4.5722 1.7791 2.6800 1.2388 1.2257 1.3166 2.8193 2.2795 2.9112 5.5585 2.0980 2.1677 2.0302 1.9694 1.6912 1.1431 1.1311 1.2879 1.4243 1.5254 1.7983 1.8816 1.4652 2.0639 1.5395 1.1125 1.4348 1.4032 1.4631 1.3057 1.4517 1.2394 2.0671 1.5203 3.0201 1.3844 2.4032 2.8166 1.0968 1.0476 1.0514 6.8295 7.5771 9.6509 8.5567 7.2087 1.0825 1.0362 1.0842 1.0594 1.0859 1.0971 1.0861 1.1035 1.1064 1.0887 1.0857 1.0946 1.0900 1.0948 1.1002 1.0916 1.0914
irintensity: 0.3456 0.5658 0.4052 1.3084 1.8578 0.9819 0.4413 0.3414 2.1153 2.9042 0.3550 0.2232 1.6728 21.8677 3.8690 2.7742 2.8711 0.9193 2.0256 3.5249 3.1803 14.6125 2.1836 23.6700 0.4477 1.0951 27.7666 1.0380 57.0161 10.4294 4.2835 0.8870 52.2759 14.2458 0.5379 71.9196 4.1688 37.1904 1.6717 2.1605 91.7559 0.2826 18.8427 25.3420 7.8929 11.6007 4.2976 12.8423 1.7504 2.8659 0.0419 3.0436 4.4656 41.6833 250.4816 2.0195 37.8947 29.7772 2.4066 72.4733 6.0751 2.5122 6.9541 13.1894 1.7749 147.3323 45.9637 118.0744 500.5614 62.5853 1.3865 25.9066 3.9188 1.8489 33.4549 1.1513 27.6603 49.3729 24.6674 5.3029 31.5028 5.3752 12.9491 34.1404 15.4733 19.1425 0.0243 7.0280 441.6232 31.3039 27.1792 4.4122 21.7169 42.6426 38.6467 26.8291 39.4271 7.6832 0.8743 26.9934 21.9648 6.2330 4.0675 4.6643 30.9604 37.4948 11.6082 8.2630
temp: 298.150 k
press: 1.00000 atm
elementType: 8 8 8 7 6 6 6 6 6 6 6 6 6 6 6 6 6 6 6 6 6 1 1 1 1 1 1 1 1 1 1 1 1 1 1 1 1 1
symmnumber: 1
zpe: 799125.1 jmol-1
zpe.correction: 0.304371 hartree
zpe.thermalcorrener: 0.321798 hartree
zpe.thermalcorrenthalpy: 0.322742 hartree
zpe.thermalcorrgfe: 0.257595 hartree
zpe.sumelectzpe: -936.869338 hartree
zpe.sumelectthermal: -936.851911 hartree
zpe.sumelectthermalent: -936.850967 hartree
zpe.sumelectthermalfe: -936.916114 hartree
dipole: -0.7361 -1.6904 -1.7210
dipole: 2.5221
quadrupole: -100.5817 -113.0525 -130.0219
quadrupole: -11.7085 5.3224 2.2246
quadrupole: 13.9704 1.4995 -15.4699 -11.7085 5.3224 2.2246
hfenergy: -937.1737089 hartree
pointgroup: C01 [X(C17H17N1O3)]
dipole: 0.2769591 0.5153027 -0.8014661 debye
polarizability: 318.3075717|-0.3530707|175.2814573|-14.6228116|-21.8922549|117.9170598 unknown
InChI: InChI=1S/C17H17NO3/c1-2-20-17(19)18-9-7-13-14(8-10-18)16-12-6-4-3-5-11(12)15(13)21-16/h3-10,13-16H,2H2,1H3
charge 0 multiplicity 1
38 atoms
O  1.154999 0.552643 1.374361
O  -4.506735 0.702335 -0.508823
O  -4.411775 -1.502875 0.268902
N  -2.444121 -0.376644 -0.415951
C  0.732674 0.528721 -0.978462
C  0.860055 -0.950527 -0.460292
C  1.528049 1.329648 0.149763
C  1.708305 -0.746522 0.875866
C  3.010113 0.993537 0.01321
C  3.126456 -0.344283 0.480364
C  -0.61343 1.165416 -1.203623
C  -0.361729 -1.78168 -0.170884
C  4.123197 1.691512 -0.473932
C  4.358216 -1.012041 0.468592
C  -1.904616 0.821214 -0.951971
C  -1.699635 -1.549901 -0.122775
C  5.381447 1.027891 -0.469115
C  5.497006 -0.303428 -0.005467
C  -3.840425 -0.476664 -0.177284
C  -5.976764 0.706033 -0.23351
C  -6.255908 1.070905 1.22619
H  1.297887 0.619863 -1.927067
H  1.481467 -1.522828 -1.177128
H  1.23764 2.380795 0.271922
H  1.577674 -1.524852 1.638352
H  -0.525957 2.167738 -1.649585
H  -0.10471 -2.817128 0.09854
H  4.041323 2.72152 -0.838533
H  4.455653 -2.044285 0.822821
H  -2.68387 1.543996 -1.195899
H  -2.359773 -2.368366 0.176845
H  6.274548 1.555533 -0.822469
H  6.478174 -0.791498 -0.005429
H  -6.361655 1.46415 -0.934209
H  -6.381825 -0.289186 -0.48566
H  -7.347199 1.155066 1.38492
H  -5.868687 0.292104 1.903968
H  -5.792966 2.038191 1.486747
