program: Gaussian 09
title: 000282198
version: EM64L-G09RevD.01
frameworkgroup: C1[X(C18H16O2S)]
method: RPBEPBE
basis: SDD
operation: Freq
keyword: #p
keyword: freq=noraman
keyword: PBEPBE/SDD
title: #p freq=noraman PBEPBE/SDD
converged: NO YES NO NO
title: Mulliken charges:
elementType: S O O C C C C C C C C C C C C C C C C C C H H H H H H H H H H H H H H H H
charge: 0.951699 -0.548422 -0.547251 0.029348 -0.699214 -0.510428 -0.486004 -0.587559 -0.561111 0.437992 0.414254 0.411961 0.406620 -0.483416 -0.449176 -0.468980 -0.463725 -0.238792 -0.236319 -0.232890 -0.230346 0.297507 0.243630 0.310799 0.265042 0.254565 0.254523 0.284576 0.275540 0.247666 0.258510 0.245603 0.241932 0.229048 0.228145 0.228376 0.226296
chargesum: 0.00000
title: Mulliken charges with hydrogens summed into heavy atoms:
elementType: S O O C C C C C C C C C C C C C C C C C C
charge: 0.951699 -0.548422 -0.547251 0.029348 -0.401706 0.044001 0.033603 -0.333036 -0.000996 0.437992 0.414254 0.411961 0.406620 -0.235750 -0.190666 -0.223377 -0.221793 -0.009744 -0.008174 -0.004514 -0.004050
polarizability: 2.40804669e+02 2.44400084e+01 2.13714514e+02 1.14326097e+01 -1.18224730e+01 1.86777500e+02
1716.lowfreq: -9.5878 -6.7591 0.0013 0.0023 0.0023 9.4623 36.4732 49.2800 62.1822
frequency: 36.1543 49.2551 62.1717 73.8702 129.9763 135.7650 151.8731 164.8374 197.2335 230.7955 235.0863 274.5239 314.0730 336.3349 346.9130 367.9505 379.7822 402.2928 432.1854 444.9261 480.8748 504.1006 514.0182 562.1945 577.4873 583.9141 616.4738 631.3979 647.6828 718.7863 745.5022 752.9122 756.7797 767.9126 775.3468 791.2543 797.7773 822.4820 830.8461 848.8653 876.0110 880.3909 886.8006 909.0268 932.6004 944.9703 949.2392 961.1189 977.5892 985.9850 986.6893 988.7935 1015.0969 1023.5595 1027.2155 1068.6841 1092.3209 1116.7958 1133.1367 1142.6802 1162.9583 1171.3069 1172.9798 1174.0346 1185.0028 1187.4287 1199.7615 1205.7215 1213.1528 1221.9321 1256.5225 1267.0968 1285.1423 1303.3108 1322.0035 1335.4647 1393.2278 1396.2959 1422.0659 1445.0435 1451.0623 1455.3908 1461.4620 1463.5134 1479.6233 1593.5887 1601.0513 1611.1186 1620.9765 2977.1958 3027.8689 3044.7043 3059.4560 3067.4323 3068.3352 3094.2995 3122.0490 3123.6037 3127.7828 3136.2702 3142.2697 3149.3784 3162.4050 3165.5494 3171.5935
redmass: 5.8462 5.5232 4.9207 4.8763 6.4596 4.2641 4.2409 4.1195 3.8596 3.4948 4.9991 7.2244 6.4309 3.0680 4.2973 4.2190 4.5550 3.4728 4.4134 3.1390 6.3543 4.7487 4.3936 6.3604 3.7168 3.6287 4.8143 5.1890 6.2007 2.6477 2.6761 2.0837 2.3452 1.6634 2.0930 3.3438 3.0395 2.8247 4.6870 3.2946 1.6670 1.5665 1.7867 4.9350 2.9296 1.5160 1.4709 2.7795 2.3852 2.3983 1.3249 1.3662 1.7644 2.2206 2.0741 2.5764 2.0831 1.7653 1.2667 2.0914 2.0996 1.0903 1.5060 1.4841 1.2461 1.4078 1.2682 1.9582 1.7845 2.0611 1.5934 1.6617 1.3764 1.3983 1.4000 1.5812 6.8241 6.6425 1.1036 2.3216 2.4522 1.1158 1.9931 1.1873 2.6419 6.3510 7.0281 7.0023 7.1588 1.0623 1.0594 1.1002 1.0881 1.0571 1.0876 1.1047 1.0860 1.0866 1.0897 1.0893 1.0940 1.0944 1.1003 1.1003 1.1135
irintensity: 4.1372 3.4067 0.6251 1.6521 5.5543 3.1772 0.7594 1.3941 4.3010 0.1874 2.1640 9.7492 28.5901 2.6311 0.4076 0.4922 11.8781 5.3335 5.6763 0.9636 9.0549 6.4008 13.1371 19.8562 1.5480 41.8880 5.2095 12.9930 0.5073 2.0791 14.4433 6.3844 6.3358 67.2775 30.1268 12.3373 7.0416 2.3981 58.5672 5.3949 10.9414 7.7268 7.6033 1.1079 9.2648 4.7305 0.7426 29.0478 5.0476 10.6571 0.1376 0.6139 4.5090 7.4617 3.1268 2.8012 3.6512 8.6126 0.5814 8.8085 3.4141 0.1447 2.0272 2.3290 8.5775 0.0011 8.0551 8.4077 1.1769 0.6185 14.2952 3.9196 18.6251 0.2085 0.3267 2.3331 0.5146 0.2238 12.8984 8.8272 0.8672 14.0205 23.3992 16.4781 11.5645 1.0445 0.1901 0.2095 0.1719 8.0192 12.2095 16.3537 26.9540 3.6942 2.4791 6.3240 3.3852 2.8806 1.7738 8.5043 24.5616 23.0515 38.5938 24.2041 1.6492
temp: 298.150 k
press: 1.00000 atm
elementType: 16 8 8 6 6 6 6 6 6 6 6 6 6 6 6 6 6 6 6 6 6 1 1 1 1 1 1 1 1 1 1 1 1 1 1 1 1
symmnumber: 1
zpe: 760165.5 jmol-1
zpe.correction: 0.289532 hartree
zpe.thermalcorrener: 0.306630 hartree
zpe.thermalcorrenthalpy: 0.307574 hartree
zpe.thermalcorrgfe: 0.244703 hartree
zpe.sumelectzpe: -1242.398250 hartree
zpe.sumelectthermal: -1242.381152 hartree
zpe.sumelectthermalent: -1242.380207 hartree
zpe.sumelectthermalfe: -1242.443078 hartree
dipole: -5.2648 -2.9241 -1.1150
dipole: 6.1247
quadrupole: -146.5202 -113.7687 -125.1834
quadrupole: -0.9417 2.6055 -1.5767
quadrupole: -18.0294 14.7221 3.3073 -0.9417 2.6055 -1.5767
hfenergy: -1242.6877814 hartree
pointgroup: C01 [X(C18H16O2S1)]
dipole: 2.2574523 -0.7252476 0.429198 debye
polarizability: 249.1763498|-17.3192767|205.6810714|8.6495666|13.7749048|186.4392609 unknown
InChI: InChI=1S/C18H16O2S/c19-21(20)10-9-18(21)11-16-12-5-1-3-7-14(12)17(18)15-8-4-2-6-13(15)16/h1-8,16-17H,9-11H2
charge 0 multiplicity 1
37 atoms
S  -2.539457 -1.622317 0.088068
O  -3.07544 -1.41567 -1.44544
O  -3.441122 -1.143285 1.364543
C  -0.510605 -1.303886 0.288252
C  0.010698 -0.37986 -0.841939
C  -0.22622 -0.707865 1.680832
C  -0.319396 -2.840197 0.094467
C  0.635427 0.602216 1.508989
C  -1.738557 -3.416855 0.323017
C  1.52221 -0.327229 -0.592011
C  -0.566137 1.014005 -0.594012
C  1.858971 0.21232 0.680861
C  -0.209419 1.557223 0.668162
C  2.529006 -0.751318 -1.47929
C  -1.388253 1.735497 -1.47888
C  3.207874 0.334126 1.061409
C  -0.660635 2.835469 1.044593
C  3.887893 -0.62622 -1.095744
C  -1.836262 3.025977 -1.10398
C  4.225072 -0.086693 0.167392
C  -1.472317 3.574036 0.14819
H  -0.252734 -0.776342 -1.835972
H  0.322681 -1.439692 2.301095
H  -1.173015 -0.4645 2.203053
H  0.420951 -3.250882 0.800505
H  0.024556 -3.051984 -0.931987
H  0.900824 1.022488 2.493283
H  -2.128432 -4.122919 -0.422509
H  -1.970385 -3.710698 1.357105
H  2.26679 -1.160059 -2.46219
H  -1.69173 1.295838 -2.434617
H  3.471562 0.754303 2.039026
H  -0.391472 3.254453 2.021122
H  4.680534 -0.942926 -1.782566
H  -2.476475 3.598428 -1.783967
H  5.278062 0.010067 0.454392
H  -1.827647 4.571552 0.429645
