program: Gaussian 09
title: 000282173
version: EM64L-G09RevD.01
frameworkgroup: C1[X(C12H20O2)]
method: RPBEPBE
basis: SDD
operation: Freq
keyword: #pfreq=noraman
keyword: PBEPBE/SDD
title: #p freq=noraman PBEPBE/SDD
converged: NO YES NO NO
title: Mulliken charges:
elementType: O O C C C C C C C C C C C C H H H H H H H H H H H H H H H H H H H H
charge: -0.448294 -0.192253 0.282465 -0.186783 -0.492881 -0.453879 -0.482234 -0.380321 -0.409086 -0.416317 0.159385 -0.413144 -0.519334 -0.367465 0.198342 0.201608 0.200655 0.262931 0.195780 0.202235 0.201016 0.193570 0.213603 0.210390 0.185841 0.262941 0.206648 0.202790 0.200947 0.237587 0.216470 0.204631 0.195049 0.327106
chargesum: 0.00000
title: Mulliken charges with hydrogens summed into heavy atoms:
elementType: O O C C C C C C C C C C C C
charge: -0.121188 -0.192253 0.282465 0.011558 -0.090617 0.004832 -0.078982 0.026852 -0.012855 0.053272 0.159385 -0.009408 -0.065277 0.032215
polarizability: 1.44232491e+02 -3.11962110e-01 1.25895280e+02 1.38323463e+00 5.45521388e-01 1.13136889e+02
1716.lowfreq: -10.7096 0.0006 0.0007 0.0010 6.8192 18.9825 80.6481 96.5838 110.1672
frequency: 80.6411 96.5617 110.1395 157.5944 194.2770 215.0192 238.5645 251.6224 271.2606 278.0045 304.1360 320.9455 339.6194 364.8568 381.0329 426.1283 463.4767 494.5015 511.5958 563.4019 573.7033 619.6983 706.4015 768.7444 776.5269 794.9304 823.5376 843.4480 854.2151 882.3852 905.1182 926.5406 934.4900 946.7372 960.4788 1000.9960 1020.7974 1035.5036 1042.9583 1065.6936 1092.8276 1110.1927 1118.7440 1127.0193 1132.9578 1136.6270 1164.1476 1178.8163 1187.5054 1198.4449 1227.3537 1241.9816 1261.2119 1276.6260 1296.6950 1300.8728 1313.4761 1319.8884 1332.8535 1336.1492 1339.6291 1341.8633 1347.2408 1353.4542 1360.0006 1364.9886 1430.2542 1448.6100 1455.8736 1460.6076 1464.1466 1465.0729 1470.7882 1482.2146 1492.5094 1611.3960 2950.4024 2951.1398 2957.2675 2957.8108 2964.8568 2974.8600 2978.1653 2987.0702 2992.6668 2995.8263 3005.5368 3014.4821 3016.7800 3028.6875 3029.3832 3047.3944 3049.3664 3052.2503 3074.2502 3538.7811
redmass: 3.0828 3.5829 3.6326 2.9511 3.4538 2.7007 2.6165 2.8853 2.8290 1.2936 2.3518 1.7960 2.4958 3.3420 2.2421 2.4570 2.5405 2.1978 2.4848 2.9373 2.7082 3.1216 2.9106 1.6539 2.4659 2.0722 1.9207 2.5488 2.2692 1.8927 1.7481 2.1242 2.3084 2.0577 2.2413 1.9476 2.0364 2.0151 1.8832 1.9541 1.7389 1.9812 2.2581 1.6382 2.1042 1.7037 1.3969 1.3633 1.4878 1.2798 1.2723 1.3813 1.3244 1.1894 1.2878 1.5466 1.4467 1.3826 1.4638 1.4185 1.5532 1.4907 1.4407 1.4034 1.4361 1.4860 1.0824 1.0869 1.0857 1.0865 1.0858 1.0829 1.0927 1.0825 1.0764 8.8791 1.0646 1.0610 1.0630 1.0626 1.0600 1.0779 1.0694 1.0635 1.0670 1.0652 1.0954 1.0983 1.0972 1.0958 1.0987 1.0984 1.1029 1.0957 1.0987 1.0657
irintensity: 0.0785 0.5406 3.7819 3.2065 0.6397 0.7351 4.0207 11.1298 17.4841 90.2280 11.1257 7.8543 7.8945 3.4638 1.9486 0.8822 7.8274 1.7055 9.7760 3.9227 0.8385 0.7074 5.4952 10.0474 10.1648 7.8315 3.8011 2.8461 9.0322 2.3264 11.2206 14.3688 5.1045 28.0410 21.3990 4.0460 3.3464 15.4134 0.0638 22.9475 1.1725 0.7594 6.9278 10.8858 8.3432 16.0915 9.4575 10.7242 24.0453 3.2547 12.2909 9.8780 9.2737 2.7903 7.1601 36.9984 2.6501 9.7330 2.3380 10.7412 12.4445 4.6956 0.3820 1.3664 1.0338 12.7157 14.7023 2.5622 9.8464 13.9083 7.8260 12.4764 5.1037 12.1396 17.7986 98.0226 13.6873 8.8392 47.5899 53.1920 36.0182 4.7648 44.2711 39.5518 29.9399 30.8059 2.8329 48.6421 75.7170 86.7459 15.2148 31.8532 44.8209 59.7458 24.6572 3.0835
temp: 298.150 k
press: 1.00000 atm
elementType: 8 8 6 6 6 6 6 6 6 6 6 6 6 6 1 1 1 1 1 1 1 1 1 1 1 1 1 1 1 1 1 1 1 1
symmnumber: 1
zpe: 785685.2 jmol-1
zpe.correction: 0.299252 hartree
zpe.thermalcorrener: 0.312747 hartree
zpe.thermalcorrenthalpy: 0.313692 hartree
zpe.thermalcorrgfe: 0.260769 hartree
zpe.sumelectzpe: -618.597705 hartree
zpe.sumelectthermal: -618.584210 hartree
zpe.sumelectthermalent: -618.583265 hartree
zpe.sumelectthermalfe: -618.636188 hartree
dipole: -0.1730 -2.9646 -3.3199
dipole: 4.4543
quadrupole: -81.8547 -84.9462 -90.3091
quadrupole: -0.8068 1.9135 -8.6359
quadrupole: 3.8486 0.7572 -4.6058 -0.8068 1.9135 -8.6359
hfenergy: -618.8969571 hartree
pointgroup: C01 [X(C12H20O2)]
dipole: -0.0456983 1.1677775 1.3058723 debye
polarizability: 144.1988904|0.206684|125.8930317|-1.7448491|0.5416219|113.1727382 unknown
InChI: InChI=1S/C12H20O2/c13-11-7-2-1-4-8-12(14)9-5-3-6-10(11)12/h10,14H,1-9H2
charge 0 multiplicity 1
34 atoms
O  0.859193 0.774033 -1.619839
O  -0.686417 -1.898219 -1.467725
C  0.635189 0.856794 -0.156738
C  0.413997 -0.626743 0.311687
C  1.910017 1.427668 0.5318
C  1.690394 -1.481228 0.063077
C  -0.557777 1.817153 0.122983
C  3.169134 0.571071 0.285257
C  2.934893 -0.882073 0.75012
C  -1.896925 1.460717 -0.578333
C  -0.79098 -1.336468 -0.343827
C  -2.998318 0.932841 0.377026
C  -2.083811 -1.490666 0.469995
C  -2.571404 -0.257521 1.265533
H  0.225555 -0.566506 1.403598
H  1.721609 1.506539 1.622393
H  2.07222 2.46259 0.163589
H  1.843371 -1.547206 -1.02811
H  1.509828 -2.510823 0.428502
H  -0.226619 2.825113 -0.205699
H  -0.703345 1.899482 1.218932
H  4.034515 1.01695 0.812471
H  3.402212 0.572257 -0.796886
H  3.821602 -1.504775 0.523485
H  2.802606 -0.900883 1.852898
H  -1.696729 0.730429 -1.384609
H  -2.297173 2.357755 -1.089087
H  -3.879227 0.635337 -0.227414
H  -3.33249 1.759685 1.036539
H  -2.868543 -1.85258 -0.2198
H  -1.88556 -2.31587 1.189657
H  -3.432042 -0.5657 1.891434
H  -1.784754 0.065535 1.976022
H  1.004078 1.694715 -1.960132
