program: Gaussian 09
title: 000282141
version: EM64L-G09RevD.01
frameworkgroup: C1[X(C9H13NO2)]
method: RPBEPBE
basis: SDD
operation: Freq
keyword: #p
keyword: freq=noraman
keyword: PBEPBE/SDD
title: #p freq=noraman PBEPBE/SDD
converged: YES YES NO NO
title: Mulliken charges:
elementType: O O N C C C C C C C C C H H H H H H H H H H H H H
charge: -0.282315 -0.260527 -0.144401 -0.145788 -0.139832 -0.494931 -0.428671 0.435501 -0.402869 0.194783 -0.812748 -0.493008 0.252271 0.258904 0.224823 0.209931 0.209299 0.229544 0.213592 0.215669 0.227216 0.226370 0.240671 0.238035 0.228483
chargesum: 0.00000
title: Mulliken charges with hydrogens summed into heavy atoms:
elementType: O O N C C C C C C C C C
charge: -0.282315 -0.260527 -0.144401 0.106483 0.119072 -0.060178 0.010172 0.435501 -0.189277 0.194783 -0.143493 0.214181
polarizability: 1.27853602e+02 -5.37010880e-01 1.15101290e+02 9.50098061e-01 -5.87766740e+00 7.85450524e+01
1716.lowfreq: -12.8398 -5.4668 -0.0008 -0.0007 -0.0005 5.7506 47.1684 66.0119 86.5192
frequency: 47.1417 65.9751 86.5176 95.1737 115.1260 170.7275 185.4050 235.1411 258.6088 275.5796 311.1740 330.6007 425.3389 468.0186 498.8810 543.4602 573.6289 687.2902 704.0630 733.0317 789.8058 798.7926 844.5805 887.5177 919.7000 939.9037 969.5395 983.1411 1022.1031 1034.9728 1051.8141 1066.8359 1087.6283 1116.0211 1131.7947 1146.6810 1167.2911 1196.7735 1212.2762 1227.6073 1279.3211 1313.3031 1347.3687 1355.9764 1376.6318 1394.5336 1420.7143 1436.9290 1446.6727 1450.0544 1453.4323 1462.0530 1469.2135 1472.0200 1633.5103 1706.2789 2955.5606 2960.2203 2961.1386 2999.7218 3002.6998 3009.8584 3029.9229 3080.4618 3088.9163 3099.6986 3102.0191 3105.3435 3141.1275
redmass: 3.3494 3.7351 1.2811 3.8645 2.6156 1.3204 2.7668 2.4122 2.9787 3.3188 3.0721 2.3419 2.1985 4.5523 5.2842 5.6529 4.0609 9.1754 5.0988 4.6261 1.6335 2.2055 2.4586 4.2730 2.0160 2.1886 2.6547 2.1629 1.8616 1.4331 1.8222 2.2780 1.9003 1.2589 1.6418 1.4562 2.0599 1.8330 1.2112 1.3373 1.7815 1.5191 1.6251 1.9695 1.7986 1.2410 1.4889 1.6834 1.1263 1.0506 1.2208 1.0475 1.0615 1.0658 10.4982 6.6661 1.0550 1.0435 1.0625 1.0296 1.0969 1.0962 1.0968 1.0981 1.0872 1.1041 1.0912 1.0919 1.1044
irintensity: 0.1809 1.8504 1.6198 1.0053 3.7817 4.0553 1.7901 2.9049 20.4451 4.8647 5.0915 1.0941 5.1135 0.4684 5.3639 2.0941 4.1878 18.0939 4.7044 7.5298 26.6955 3.1422 2.3828 16.5773 3.3252 4.2236 1.9400 0.2232 77.3836 26.3688 29.9493 50.6405 31.5830 0.0917 0.8584 72.0723 15.2574 138.0806 7.3335 44.1755 97.4839 64.8809 25.3864 18.8959 8.1126 10.9253 6.2369 185.1059 26.0945 12.6209 32.6439 15.7796 7.5077 12.0779 448.5114 2.2127 14.6307 73.6723 34.6970 48.3258 15.7593 18.3818 28.3022 24.2489 8.8245 18.5555 74.1762 13.5040 18.2335
temp: 298.150 k
press: 1.00000 atm
elementType: 8 8 7 6 6 6 6 6 6 6 6 6 1 1 1 1 1 1 1 1 1 1 1 1 1
symmnumber: 1
zpe: 538082.5 jmol-1
zpe.correction: 0.204945 hartree
zpe.thermalcorrener: 0.217358 hartree
zpe.thermalcorrenthalpy: 0.218302 hartree
zpe.thermalcorrgfe: 0.165716 hartree
zpe.sumelectzpe: -554.982343 hartree
zpe.sumelectthermal: -554.969930 hartree
zpe.sumelectthermalent: -554.968986 hartree
zpe.sumelectthermalfe: -555.021571 hartree
dipole: 1.5335 -1.5192 2.0419
dipole: 2.9713
quadrupole: -65.8861 -69.9972 -69.8313
quadrupole: 7.4850 -2.5403 1.9993
quadrupole: 2.6854 -1.4256 -1.2598 7.4850 -2.5403 1.9993
hfenergy: -555.1872876 hartree
pointgroup: C01 [X(C9H13N1O2)]
dipole: -0.5779518 0.410219 0.9296656 debye
dipolederiv: -1.0868476 -0.3957159 0.0514936 -0.7897479 -0.9613248 -0.1011504 -0.1625518 -0.2055652 -0.3536521 -0.9723075 0.1485591 0.2573164 0.2245505 -0.7349593 -0.2305845 0.2824999 -0.2149645 -0.5083106 -1.9316935 -0.2169999 0.4248933 -0.1497671 -0.3081021 0.1193785 0.2604296 0.1471496 -0.4404673 0.5078 -0.0845957 -0.1004691 -0.1767364 0.1392071 -0.0554186 -0.148653 -0.0710622 0.277051 0.4977752 0.1416204 0.011148 0.2293971 0.1744644 -0.0991611 0.0403804 -0.1124126 0.2279833 -0.0146397 0.0852493 -0.0947889 0.1091501 0.0528263 -0.051238 -0.1164006 -0.0103011 0.0590083 0.0474987 0.0272232 -0.0988649 0.036303 0.0042865 -0.0120122 -0.1332533 -0.0404006 0.1264586 0.1345216 -0.0723126 0.1429704 -0.0651363 0.1341501 0.0693086 0.1955191 0.0752259 0.0362948 -0.0207506 -0.1219761 0.1231613 -0.104617 -0.0377495 0.0552943 0.1753535 0.0115966 -0.1439833 2.4315098 0.2226255 -0.4742214 0.4676639 1.3040838 0.3518183 -0.1924238 0.4318235 0.5057982 -0.0319868 0.053572 -0.0627815 0.0881652 -0.0176855 0.021821 -0.0701679 0.0063457 0.0690479 0.7034207 0.2227679 -0.0087338 0.1400684 0.3098926 -0.0242923 -0.0340814 -0.045069 0.2693992 -0.0731928 0.0273194 -0.10002 0.0090071 0.0766633 -0.0226847 -0.0124867 -0.0261272 -0.0849859 -0.0665907 0.0729505 -0.0713562 -0.0002924 -0.0506046 0.0708938 0.0013446 0.0707317 0.0463018 0.0376693 -0.0530693 -0.0155395 -0.0233639 -0.1422487 -0.0083054 -0.0145642 0.0575948 0.0816316 -0.0244456 0.0035194 0.0835814 0.0172512 0.0825615 -0.0071903 0.0590553 -0.0624361 -0.1376553 -0.0234594 -0.0425489 0.0416697 -0.0490627 -0.1073742 0.0741481 0.0176718 0.1496438 0.0402187 0.0155996 0.0690604 0.0419029 0.0387927 0.0274307 -0.0650839 0.0018663 -0.1212559 -0.0742444 -0.0778681 0.0054307 -0.1425182 0.0186834 0.0722552 -0.0376848 -0.164837 -0.0517616 0.0294938 0.0220561 0.0886634 0.0667468 0.0630242 0.0427021 -0.0462984 0.1291244 -0.0861656 -0.095527 -0.0524406 -0.003226 -0.0967486 -0.0829915 0.0532457 -0.0788564 -0.148387 -0.0272753 0.0002759 0.0321838 -0.0847875 0.0506275 -0.0227375 -0.1195173 0.0734284 0.0129366 0.0920528 0.0725662 -0.0220351 -0.0556918 0.0052242 -0.0010267 0.0964182 -0.0057284 0.0841957 0.0520003 -0.1223017 -0.0789109 0.0015813 -0.0399207 0.1213383 -0.0071631 0.0865141 -0.0320577 0.0753086 0.0438221 0.047134 -0.0392188 0.0052271 -0.0979156 -0.0834583 -0.0769158 -0.0305128 -0.0946764 0.0757762 unknown
polarizability: 127.6967312|0.5050655|111.2929877|-3.0254137|12.5760448|82.5102253 unknown
InChI: InChI=1S/C9H13NO2/c1-6-3-4-7-8(5-6)10(7)9(11)12-2/h3,7-8H,4-5H2,1-2H3
charge 0 multiplicity 1
25 atoms
O  2.453403 1.015887 0.009046
O  2.65005 -1.085909 -1.03239
N  0.579323 -0.27183 -0.243463
C  -0.180734 -0.039402 1.014476
C  -0.19054 -1.412407 0.315527
C  -1.396933 0.868722 0.943216
C  -1.422946 -1.868153 -0.449798
C  -2.447242 0.450122 -0.078794
C  -2.444758 -0.770016 -0.680111
C  1.949256 -0.216349 -0.455299
C  -3.512042 1.48932 -0.372727
C  3.88221 1.245815 -0.294975
H  0.429679 0.052082 1.923109
H  0.413781 -2.209424 0.770104
H  -1.063031 1.904994 0.73053
H  -1.864841 0.901595 1.950446
H  -1.892039 -2.701634 0.115264
H  -1.107808 -2.299345 -1.420963
H  -3.242653 -1.004496 -1.398585
H  -4.026993 1.812522 0.554151
H  -4.275729 1.107562 -1.07205
H  -3.063271 2.399042 -0.819413
H  4.045419 1.261017 -1.386048
H  4.508172 0.453681 0.150114
H  4.107667 2.225603 0.150234
