program: Gaussian 09
title: 000282167
version: EM64L-G09RevD.01
frameworkgroup: C1[X(C16H13NO)]
method: RPBEPBE
basis: SDD
operation: Freq
keyword: #p
keyword: freq=noraman
keyword: PBEPBE/SDD
title: #p freq=noraman PBEPBE/SDD
converged: NO YES NO NO
title: Mulliken charges:
elementType: O N C C C C C C C C C C C C C C C C H H H H H H H H H H H H H
charge: -0.254667 -0.088318 0.325258 0.206222 0.299758 0.090320 -0.320400 -0.065655 -0.277806 -0.363601 -0.389190 -0.378709 -0.356564 -0.234475 -0.235308 -0.264475 -0.224603 -0.506252 0.218490 0.217458 0.253440 0.245745 0.236181 0.246382 0.232249 0.231061 0.227646 0.227503 0.228662 0.239981 0.233665
chargesum: 0.00000
title: Mulliken charges with hydrogens summed into heavy atoms:
elementType: O N C C C C C C C C C C C C C C C C
charge: -0.254667 -0.088318 0.325258 0.206222 0.299758 0.090320 -0.101911 -0.065655 -0.060348 -0.110161 -0.143444 -0.142527 -0.110182 -0.002225 -0.004247 -0.036829 0.002900 0.196056
polarizability: 2.39857608e+02 3.49269568e+00 1.78323649e+02 -2.97003098e-01 -1.70656245e+01 1.40433449e+02
1716.lowfreq: -13.3814 -4.4768 -0.0007 0.0000 0.0004 10.7094 42.0931 74.5223 79.3251
frequency: 42.0819 74.4919 79.3137 124.3486 135.4921 140.0947 171.8103 204.6524 233.4863 269.0354 290.7950 351.6624 365.1066 375.3584 414.5125 449.7807 491.6146 511.1508 536.2458 546.8582 566.6344 574.5349 641.7867 654.9394 680.3162 689.6241 705.3417 757.3464 761.4834 768.1822 776.9604 786.6316 839.8759 870.3177 883.0942 889.5155 924.6347 946.1289 958.1079 968.7868 978.3790 991.3863 1034.8569 1040.7017 1063.6973 1099.0230 1111.0730 1122.0477 1144.1651 1157.2193 1169.3333 1175.7384 1208.0259 1226.4749 1247.1766 1256.8046 1271.4920 1282.0825 1369.6498 1374.4696 1392.7653 1415.1615 1423.7414 1438.7348 1445.1329 1464.4759 1475.3053 1485.5449 1568.1400 1582.2642 1600.8085 1602.6109 1653.6236 1675.5558 2997.8440 3074.4213 3097.8192 3103.3215 3118.8983 3125.1031 3131.7863 3138.2837 3139.1949 3150.6329 3151.7856 3165.6275 3167.9540
redmass: 4.9629 3.8204 4.0570 3.8197 2.4858 2.8147 1.5260 4.0259 4.2152 4.1647 4.8251 4.9860 4.9160 3.6456 4.8337 3.2891 4.1514 4.8005 4.7932 5.0113 3.9284 4.2427 6.1375 6.1247 4.6488 4.1336 2.1122 2.3421 2.0711 1.5680 3.7296 2.0918 2.8730 1.6350 2.0474 2.9875 6.5260 1.4065 1.4309 1.3073 1.3192 1.3390 2.7063 2.3207 4.3995 2.1369 1.2720 1.8895 1.4737 1.9188 1.0707 1.0651 2.1571 2.8340 1.6030 2.2657 1.6281 1.5565 7.8578 6.7996 1.5658 1.6400 1.3876 2.2487 1.0529 1.0838 2.4609 2.6410 6.8546 7.2409 6.1163 6.2441 8.7219 11.6169 1.0290 1.0825 1.1036 1.0945 1.0870 1.0863 1.0881 1.0892 1.1049 1.0937 1.0944 1.1006 1.1006
irintensity: 0.0543 1.8934 0.1197 2.0702 2.8696 1.5482 0.3934 2.5054 4.6568 4.9725 0.5200 2.6313 3.1011 4.0874 10.5496 14.1514 1.6582 1.8742 0.6611 0.5569 0.7016 4.2252 10.3025 7.2291 4.0230 8.4853 7.1512 34.2012 33.4650 62.1284 28.6213 40.8172 14.8903 1.4374 3.2169 1.0848 6.1836 2.6839 2.6641 1.4056 0.0394 0.1495 22.0727 8.2405 115.3531 5.6807 0.3212 39.3361 30.4360 12.2495 0.2878 0.7926 2.7712 58.9501 22.7081 109.9618 18.3522 18.8738 1.4067 2.9009 1.5960 14.5444 8.6420 11.8752 14.4413 31.9592 13.0707 24.6921 5.7658 5.8491 18.6773 20.2466 11.3593 349.2105 43.9802 0.5441 24.8585 33.7053 7.9072 3.3037 8.7501 7.3169 26.4446 21.8376 24.4053 32.1186 24.7342
temp: 298.150 k
press: 1.00000 atm
elementType: 8 7 6 6 6 6 6 6 6 6 6 6 6 6 6 6 6 6 1 1 1 1 1 1 1 1 1 1 1 1 1
symmnumber: 1
zpe: 637385.1 jmol-1
zpe.correction: 0.242767 hartree
zpe.thermalcorrener: 0.257347 hartree
zpe.thermalcorrenthalpy: 0.258291 hartree
zpe.thermalcorrgfe: 0.201226 hartree
zpe.sumelectzpe: -746.207379 hartree
zpe.sumelectthermal: -746.192800 hartree
zpe.sumelectthermalent: -746.191855 hartree
zpe.sumelectthermalfe: -746.248921 hartree
dipole: 0.5830 -0.3394 -0.0902
dipole: 0.6806
quadrupole: -98.9137 -91.5539 -98.8030
quadrupole: -0.6719 -1.7380 -4.8262
quadrupole: -2.4902 4.8697 -2.3795 -0.6719 -1.7380 -4.8262
hfenergy: -746.4501463 hartree
pointgroup: C01 [X(C16H13N1O1)]
dipole: 0.2398056 0.111595 0.0416621 debye
polarizability: 238.7485995|-7.798443|183.1562081|-6.5103987|-10.4044738|136.7098976 unknown
InChI: InChI=1S/C16H13NO/c1-18-16-14-8-4-2-6-12(14)10-11-13-7-3-5-9-15(13)17-16/h2-11H,1H3
charge 0 multiplicity 1
31 atoms
O  1.343235 -2.494103 -0.854834
N  -0.676569 -1.482447 -0.308773
C  1.496221 0.98529 -0.480796
C  1.546928 -0.322798 0.079912
C  -1.724696 0.795913 -0.409943
C  -1.582297 -0.506207 0.167877
C  0.515551 1.409912 -1.516446
C  0.61364 -1.403751 -0.371185
C  -0.847385 1.328852 -1.482681
C  2.549306 -0.655111 1.02596
C  2.480797 1.92805 -0.074923
C  -2.808726 1.611212 0.018741
C  -2.501156 -0.926894 1.169771
C  3.490246 0.306231 1.44864
C  3.457125 1.604832 0.889227
C  -3.695594 1.200009 1.0333
C  -3.5313 -0.078782 1.618495
C  0.553805 -3.662103 -1.30101
H  0.957611 1.947778 -2.368172
H  -1.382598 1.811954 -2.313899
H  2.591885 -1.677724 1.414195
H  2.465228 2.929661 -0.520382
H  -2.935121 2.596556 -0.446651
H  -2.393236 -1.940012 1.570696
H  4.252239 0.041132 2.189231
H  4.193709 2.356067 1.194731
H  -4.508746 1.85892 1.355566
H  -4.218248 -0.42189 2.40017
H  1.30726 -4.388338 -1.639455
H  -0.125864 -3.375166 -2.121226
H  -0.049052 -4.061743 -0.467436
