program: Gaussian 09
title: 000282178
version: EM64L-G09RevD.01
frameworkgroup: C1[X(C15H24N2O2)]
method: RPBEPBE
basis: SDD
operation: Freq
keyword: #p
keyword: freq=noraman
keyword: PBEPBE/SDD
title: #p freq=noraman PBEPBE/SDD
converged: YES YES NO NO
title: Mulliken charges:
elementType: O O N N C C C C C C C C C C C C C C C H H H H H H H H H H H H H H H H H H H H H H H H
charge: -0.247043 -0.262273 -0.095213 -0.197497 -0.344672 -0.428587 -0.348314 -0.336038 -0.313181 -0.322408 -0.226561 0.133824 0.381924 -0.369519 -0.445614 0.438226 -0.715034 -0.809511 -0.812397 0.202370 0.229707 0.263560 0.244412 0.192799 0.206621 0.221520 0.199229 0.189392 0.212454 0.215778 0.191193 0.242311 0.231609 0.201400 0.225582 0.236861 0.223256 0.237907 0.236464 0.238698 0.220746 0.229983 0.226037
chargesum: 0.00000
title: Mulliken charges with hydrogens summed into heavy atoms:
elementType: O O N N C C C C C C C C C C C C C C C
charge: -0.247043 -0.262273 -0.095213 -0.197497 0.087405 0.079384 0.051106 0.084710 0.088665 0.084562 0.015750 0.133824 0.381924 -0.137911 -0.244215 0.438226 -0.029333 -0.096442 -0.135631
polarizability: 2.12405182e+02 6.83494671e+00 1.84487427e+02 1.63201356e+01 -5.45413832e+00 1.51456901e+02
1716.lowfreq: -26.3758 -12.6040 -0.0005 -0.0002 0.0003 2.2820 13.1190 25.9951 30.6079
frequency: -21.3753 25.5479 30.3028 67.8668 90.3430 96.8491 119.4778 147.3018 158.5616 179.3651 192.8447 216.5347 220.6266 239.4716 251.7646 276.9702 314.6827 323.1056 336.4219 376.9586 382.2224 388.1488 397.7043 412.5770 431.1972 468.7946 473.2277 496.0362 552.5081 558.6786 597.4442 625.6391 672.3312 693.9125 731.3413 762.6476 787.0974 809.5915 810.3073 839.5196 842.5651 872.5305 896.3607 906.9652 956.0366 968.0072 997.4522 1017.5188 1026.7958 1030.3900 1042.5743 1044.7680 1047.4104 1053.9323 1073.5518 1078.6388 1089.2718 1096.5053 1108.7746 1134.7043 1137.9198 1151.9456 1189.2719 1191.1863 1208.4263 1229.6893 1255.3593 1270.8355 1290.0164 1295.4020 1300.7231 1318.6747 1327.7006 1332.4732 1334.1454 1342.1502 1351.7130 1369.1261 1372.6682 1379.4591 1392.1788 1393.9988 1398.4227 1408.5564 1443.2498 1446.9743 1451.1374 1452.9058 1459.0747 1463.4450 1469.3351 1469.9410 1472.7045 1473.9949 1480.2846 1490.2174 1570.8132 1619.4627 1651.6695 2867.8824 2880.5501 2905.3098 2952.4560 2957.6100 2969.5180 2976.9753 2988.7102 3018.2265 3026.7824 3045.0919 3045.4810 3047.8878 3052.9243 3061.4630 3079.0573 3080.5956 3084.5144 3087.7393 3095.5469 3102.6263 3107.9813 3117.6415 3123.7671
redmass: 3.4653 3.9065 4.2299 3.7487 4.4553 3.8169 3.6889 1.4851 2.0568 2.5178 2.5047 1.4222 1.7211 1.8173 1.1380 2.7847 2.2395 3.5306 3.1903 3.6527 3.6064 3.0024 3.1640 2.8320 2.9258 2.8384 5.0528 3.4616 3.3244 4.6154 1.9846 3.0861 3.8853 3.4927 4.9984 1.9010 2.0211 2.5863 1.5916 1.6156 1.3713 2.8805 2.6607 2.5529 2.3692 1.5494 2.7413 1.5362 2.2370 1.5614 1.5199 3.0862 1.6759 2.0129 2.2341 2.3028 3.1619 3.5926 2.4444 2.6356 2.9260 2.2777 1.2655 1.5423 1.9257 2.1684 1.6019 1.3047 1.4674 1.3062 1.2385 1.3691 1.4573 1.3294 1.2663 1.5052 1.3988 1.3380 1.3263 1.2265 1.5076 1.2251 1.2394 1.7958 1.0830 1.0822 1.0926 1.0967 1.0981 1.0476 1.0491 1.0562 1.0647 1.0884 1.0554 1.1111 6.5955 7.3434 6.0730 1.0698 1.0699 1.0678 1.0665 1.0667 1.0371 1.0380 1.0353 1.0922 1.0897 1.0852 1.0969 1.0895 1.0965 1.0605 1.0964 1.1000 1.0974 1.0986 1.0967 1.0991 1.0893 1.0918 1.1045
irintensity: 0.2240 0.6799 0.2053 1.7352 1.4303 1.5527 0.1649 1.9102 2.0001 0.1764 3.8984 1.6127 1.0778 2.2417 0.4528 0.8735 12.2458 1.7833 0.8438 4.5179 2.5633 3.4640 0.4794 7.5342 6.7509 0.4945 0.2001 13.2800 5.3091 7.7158 2.6730 7.1629 4.1419 14.7195 8.5243 9.2316 2.1344 7.1000 63.7841 0.3802 6.0704 8.0729 4.8205 0.1298 12.8342 8.6835 21.8391 8.3972 9.3953 4.4782 5.6414 24.6130 3.2725 10.8644 8.9031 10.5110 24.8193 16.0091 1.6885 41.4422 57.9960 28.9765 1.9397 10.6827 20.4034 55.2340 1.0756 5.7612 40.6347 3.8708 6.3418 2.3764 1.1828 12.5231 0.8674 19.2462 1.2371 1.6177 0.6107 21.4724 4.6918 11.6712 29.1134 51.9166 2.6315 13.4848 34.0660 17.1005 5.4641 16.0951 22.6683 14.0186 5.0975 11.6146 3.0430 7.1427 229.5664 55.5189 29.8244 61.9371 67.8554 69.0326 39.6940 101.7460 42.0066 31.1971 35.7533 6.8648 56.5517 7.2559 21.8182 24.3722 22.0822 30.8486 41.6887 20.1140 34.7767 18.9483 16.1228 18.8026 33.8814 21.3170 5.9642
temp: 298.150 k
press: 1.00000 atm
elementType: 8 8 7 7 6 6 6 6 6 6 6 6 6 6 6 6 6 6 6 1 1 1 1 1 1 1 1 1 1 1 1 1 1 1 1 1 1 1 1 1 1 1 1
symmnumber: 1
zpe: 970017.5 jmol-1
zpe.correction: 0.369460 hartree
zpe.thermalcorrener: 0.388251 hartree
zpe.thermalcorrenthalpy: 0.389195 hartree
zpe.thermalcorrgfe: 0.322487 hartree
zpe.sumelectzpe: -844.416782 hartree
zpe.sumelectthermal: -844.397991 hartree
zpe.sumelectthermalent: -844.397047 hartree
zpe.sumelectthermalfe: -844.463755 hartree
dipole: -2.7246 -3.3419 1.7094
dipole: 4.6383
quadrupole: -124.7922 -113.6827 -113.1244
quadrupole: 0.1461 4.7850 1.1296
quadrupole: -7.5924 3.5171 4.0754 0.1461 4.7850 1.1296
hfenergy: -844.7862422 hartree
pointgroup: C01 [X(C15H24N2O2)]
dipole: -1.0212036 -1.2220125 0.8909858 debye
polarizability: 213.0727093|9.2873617|182.5601942|13.2827826|-10.0111489|152.716607 unknown
InChI: InChI=1S/C15H24N2O2/c1-12-10-13(2)15(18)17(14(3)11-12)5-4-16-6-8-19-9-7-16/h10-11,13H,4-9H2,1-3H3
charge 0 multiplicity 1
43 atoms
O  5.568447 0.085336 -0.769681
O  -0.706147 2.161058 -0.779511
N  2.782773 -0.23039 -0.003445
N  -0.938405 0.308783 0.616923
C  1.326649 -0.448396 -0.161418
C  0.533398 0.414824 0.847827
C  3.604452 -1.396539 -0.419348
C  3.259879 0.998016 -0.696547
C  5.083704 -1.128752 -0.093113
C  4.741779 1.238688 -0.37076
C  -3.000925 1.414651 -0.38889
C  -1.476997 1.323214 -0.216709
C  -1.628065 -0.823902 1.144615
C  -3.503356 0.196521 -1.14849
C  -2.715189 -1.437072 0.555029
C  -3.410061 -1.091737 -0.686295
C  -3.756293 1.695729 0.940338
C  -1.070731 -1.398618 2.440266
C  -4.059014 -2.246155 -1.437129
H  1.110537 -1.518388 0.023855
H  0.972563 -0.212495 -1.192798
H  0.802829 1.474087 0.720243
H  0.783921 0.111999 1.875077
H  3.505935 -1.603739 -1.514746
H  3.26415 -2.293919 0.131812
H  2.662402 1.867403 -0.368892
H  3.136923 0.904209 -1.804378
H  5.203829 -1.018006 1.006658
H  5.727543 -1.946488 -0.457589
H  5.140512 2.095577 -0.938326
H  4.858327 1.423001 0.719095
H  -3.128883 2.298443 -1.037436
H  -3.985572 0.382873 -2.116887
H  -3.074687 -2.33947 1.067562
H  -4.823808 1.876889 0.722391
H  -3.692298 0.850546 1.644488
H  -3.346423 2.597164 1.431511
H  -0.078191 -1.869399 2.309229
H  -1.754208 -2.1728 2.823889
H  -0.9685 -0.617608 3.217191
H  -4.770283 -2.789259 -0.784244
H  -3.304683 -2.982572 -1.773717
H  -4.614028 -1.892407 -2.322552
