program: Gaussian 09
title: 000282142
version: EM64L-G09RevD.01
frameworkgroup: C1[X(C9H14INO2)]
method: RPBEPBE
basis: SDD
operation: Freq
keyword: #p
keyword: freq=noraman
keyword: PBEPBE/SDD
title: #p freq=noraman PBEPBE/SDD
converged: YES YES NO NO
title: Mulliken charges:
elementType: I O O N C C C C C C C C C H H H H H H H H H H H H H H
charge: 0.022970 -0.308608 -0.302312 -0.397667 0.394038 -0.709473 -0.483830 -0.376109 -0.721515 -0.182573 -0.195721 0.289455 -0.495539 0.317160 0.220149 0.282894 0.239475 0.239230 0.211986 0.258160 0.239263 0.324463 0.210532 0.215781 0.239290 0.230227 0.238271
chargesum: 0.00000
title: Mulliken charges with hydrogens summed into heavy atoms:
elementType: I O O N C C C C C C C C C
charge: 0.022970 -0.308608 -0.302312 -0.073204 0.394038 -0.392312 0.019213 0.102596 -0.012106 0.027959 0.020060 0.289455 0.212250
polarizability: 1.49934697e+02 -1.75213847e+01 1.33987363e+02 -8.69126785e+00 2.57980561e+00 1.09138795e+02
1716.lowfreq: -5.8178 -0.0002 0.0003 0.0004 7.2773 19.3264 44.4609 53.3975 72.7930
frequency: 44.4252 53.3645 72.7796 79.8821 120.4004 127.4133 151.0886 171.0667 198.3227 213.5379 242.3128 280.6030 315.7971 351.4278 386.2876 391.1249 464.8212 503.4353 524.2154 538.6023 602.0033 659.1036 675.5687 707.0263 732.3065 817.2121 868.6545 888.7757 913.3905 939.6799 955.2091 964.1226 973.4634 1014.5199 1046.5927 1075.2737 1108.2694 1118.7992 1128.3266 1134.6793 1148.4884 1162.7389 1182.4524 1201.7205 1231.0044 1271.8622 1307.3780 1324.9007 1340.8591 1369.0807 1388.4213 1422.5578 1451.3572 1455.9914 1460.7959 1465.2567 1468.9377 1481.8943 1486.0874 1660.8476 1683.7915 2974.3982 2980.9452 2990.4092 2999.7235 3035.6692 3036.4409 3085.3210 3091.0050 3098.8788 3104.0409 3106.0017 3137.1731 3141.5122 3517.6085
redmass: 5.2494 1.5873 2.5738 4.2535 2.8188 2.9123 4.7572 3.6401 6.6876 2.3911 1.1991 3.7985 3.2269 3.6826 2.1321 3.1074 3.1113 3.3062 4.1307 1.3702 3.7354 1.9259 2.0010 9.9203 3.7763 2.8349 2.8922 4.2498 3.2325 2.1406 1.6781 1.9333 1.3785 1.8167 4.4077 2.2046 2.5282 1.2553 1.6858 1.3060 1.4465 1.9914 1.0735 1.7161 1.7937 1.7373 1.4769 1.4507 1.6330 1.5800 1.2062 1.1525 1.0504 1.1020 1.1218 1.0961 1.0660 1.0574 1.5642 8.2901 6.5406 1.0634 1.0641 1.0361 1.0298 1.0958 1.0958 1.0890 1.0977 1.1046 1.1003 1.0843 1.1002 1.1041 1.0767
irintensity: 0.6758 1.0043 6.0907 1.3605 2.8117 0.4209 0.3980 6.0125 5.1026 2.1836 0.7874 20.2994 5.4381 5.6078 0.3566 1.7951 1.3728 7.8942 3.5205 58.7718 61.5101 20.1557 51.0680 30.6952 0.7113 40.7985 7.5761 3.2665 13.8191 4.0711 6.1287 21.6928 0.2425 6.9143 154.5195 9.3299 34.6385 0.3704 18.5470 17.7442 48.1063 25.7814 2.0421 116.2146 83.7805 7.5345 20.1858 7.9364 10.0181 1.5410 24.6226 7.6782 13.0355 75.5744 87.7844 6.1863 55.7786 30.5834 267.0848 225.7545 11.1770 20.6070 17.1007 22.2228 46.9061 1.7752 17.0864 0.7287 26.8275 30.0977 12.1673 4.5293 50.4740 17.7058 46.4026
temp: 298.150 k
press: 1.00000 atm
elementType: 53 8 8 7 6 6 6 6 6 6 6 6 6 1 1 1 1 1 1 1 1 1 1 1 1 1 1
symmnumber: 1
zpe: 573127.5 jmol-1
zpe.correction: 0.218293 hartree
zpe.thermalcorrener: 0.232736 hartree
zpe.thermalcorrenthalpy: 0.233680 hartree
zpe.thermalcorrgfe: 0.175201 hartree
zpe.sumelectzpe: -567.047761 hartree
zpe.sumelectthermal: -567.033318 hartree
zpe.sumelectthermalent: -567.032373 hartree
zpe.sumelectthermalfe: -567.090852 hartree
dipole: -0.0536 1.1503 -0.8868
dipole: 1.4534
quadrupole: -95.9545 -85.9474 -91.5318
quadrupole: 5.6850 4.7298 0.5876
quadrupole: -4.8099 5.1972 -0.3873 5.6850 4.7298 0.5876
hfenergy: -567.2660535 hartree
pointgroup: C01 [X(C9H14I1N1O2)]
dipole: 0.2561036 -0.4392341 0.2616559 debye
polarizability: 128.3598614|12.2967009|151.646383|7.4690346|15.0743683|113.0546106 unknown
InChI: InChI=1S/C9H14INO2/c1-9(11-8(12)13-2)6-4-3-5-7(9)10/h3-4,7,11H,5-6H2,1-2H3
charge 0 multiplicity 1
27 atoms
I  1.916788 2.864473 0.573078
O  -2.621007 0.338311 1.101317
O  -2.246562 -0.689447 -0.986522
N  -0.528202 0.381132 0.235636
C  0.586399 0.26063 -0.738779
C  1.896353 0.67805 -0.021516
C  0.786594 -1.238023 -1.174813
C  2.226628 -0.149532 1.234165
C  0.293983 1.102522 -2.005311
C  1.450171 -2.119018 -0.139489
C  2.104986 -1.637273 0.946076
C  -1.81284 -0.048852 0.00978
C  -4.035709 -0.070091 0.996723
H  2.721481 0.641307 -0.750948
H  1.381383 -1.244536 -2.111172
H  -0.210734 -1.632078 -1.445032
H  1.556009 0.122188 2.07391
H  3.250221 0.096769 1.572982
H  1.166745 1.101797 -2.683613
H  -0.569935 0.671471 -2.539666
H  0.0601 2.14653 -1.737968
H  -0.385875 0.973154 1.058272
H  1.384724 -3.20356 -0.299698
H  2.562792 -2.320654 1.672791
H  -4.498306 0.359954 0.092091
H  -4.508257 0.326693 1.906703
H  -4.119929 -1.169519 0.956404
