program: Gaussian 09
title: 000022571
version: EM64L-G09RevD.01
frameworkgroup: C1[X(C24H27NO2)]
method: RPBEPBE
basis: SDD
operation: Freq
keyword: #p
keyword: freq=noraman
keyword: PBEPBE/SDD
title: #p freq=noraman PBEPBE/SDD
converged: YES YES NO NO
title: Mulliken charges:
elementType: O O N C C C C C C C C C C C C C C C C C C C C C C C C H H H H H H H H H H H H H H H H H H H H H H H H H H H
charge: -0.264244 -0.221502 -0.018007 -0.016565 -0.424996 -0.413178 -0.366676 -0.331735 -0.355445 -0.725054 -0.697183 0.140905 -0.026073 0.262108 0.293602 0.283525 -0.386937 -0.374066 -0.380199 -0.381869 -0.240317 -0.219915 -0.232188 -0.225444 -0.230245 -0.236827 -0.234382 0.221981 0.189428 0.198995 0.210791 0.227339 0.193476 0.201477 0.230365 0.233423 0.195339 0.194752 0.217956 0.221867 0.217218 0.209753 0.211501 0.216575 0.249616 0.262761 0.256766 0.262248 0.231467 0.235998 0.231253 0.232687 0.232716 0.235157
chargesum: 0.00000
title: Mulliken charges with hydrogens summed into heavy atoms:
elementType: O O N C C C C C C C C C C C C C C C C C C C C C C C C
charge: -0.264244 -0.221502 -0.018007 0.205417 -0.036573 0.024952 0.028277 0.132053 0.034646 -0.068013 -0.059354 0.140905 -0.026073 0.262108 0.293602 0.283525 -0.137321 -0.111305 -0.123432 -0.119621 -0.240317 0.011552 0.003810 0.005808 0.002442 -0.004111 0.000775
polarizability: 3.71582566e+02 6.71118634e-01 3.11711046e+02 -6.15251378e+00 6.54785908e+00 1.86647752e+02
1716.lowfreq: -32.4179 -7.4005 -4.8767 -0.0003 0.0008 0.0010 1.7906 9.4343 21.1006
frequency: -29.2293 4.6349 21.0111 24.3455 41.2841 45.5178 53.2783 64.0417 69.5285 73.3144 79.2738 97.4191 110.6727 120.8580 130.2779 157.4980 159.8979 187.7339 203.2288 226.7232 232.3531 237.3566 257.7646 266.7443 275.2318 290.2949 295.6911 304.2313 353.4733 401.5346 406.6937 411.3995 448.0417 458.0982 482.8082 501.0427 504.3329 527.1853 560.9378 605.6442 614.0775 615.3740 658.8752 661.8775 699.9967 701.8158 725.3329 731.3564 743.9508 761.3891 767.0336 772.1111 791.1049 803.1286 843.5278 853.2222 857.2247 888.7130 903.8176 910.2939 924.1045 937.7521 942.0416 959.7424 975.1941 982.0392 983.8831 988.8036 989.2788 996.6969 999.9092 1001.7806 1023.9872 1026.7819 1029.8798 1037.8074 1075.4727 1076.6100 1089.4332 1091.3739 1092.4417 1128.8005 1149.7380 1163.6443 1175.0789 1176.3013 1185.3057 1193.3866 1197.7645 1201.3107 1204.2137 1212.7728 1250.2402 1266.8561 1277.8255 1290.1030 1296.1208 1302.3235 1322.1570 1326.1831 1327.9754 1341.8193 1354.7226 1357.2614 1368.1898 1375.9368 1379.2259 1389.2812 1391.3782 1433.4577 1434.4996 1458.8729 1465.8131 1472.2879 1475.4731 1475.9295 1477.7398 1479.1898 1483.3824 1485.2328 1488.4742 1490.6467 1533.7074 1578.4958 1581.3022 1605.5009 1607.7142 1612.1952 2157.1001 2952.7359 2957.8748 2967.6461 2971.3465 2972.3948 2976.7558 2991.8197 2998.5209 3001.8108 3007.9683 3034.8289 3038.8736 3065.9470 3068.9758 3071.3219 3071.6107 3073.5203 3126.8086 3130.8538 3132.7002 3140.0305 3143.8914 3151.0345 3154.3419 3160.4526 3168.4641 3171.7588
redmass: 2.9402 4.6697 5.1289 6.1673 3.1028 4.0873 4.2498 1.9382 4.1980 4.0303 4.9060 3.7680 3.5522 2.9584 3.5396 2.8526 3.6881 3.9400 4.5279 1.2278 4.5988 1.3836 3.0127 3.8548 5.2071 4.5427 4.0058 2.6652 4.7747 3.2806 3.0853 3.7042 4.0215 3.4741 4.2692 4.7285 4.1908 2.3798 6.5198 6.6833 6.3588 6.5939 6.2038 6.2197 1.7338 1.7801 1.4437 2.3097 3.1896 1.6755 1.5219 1.9475 2.7012 1.4867 6.4631 1.2489 1.2445 1.7910 5.1978 1.3249 2.5433 1.5257 2.0334 1.7171 2.1867 1.3994 1.3864 6.1788 5.9142 1.7877 1.3289 1.3304 1.4153 2.3396 2.1045 2.5843 3.4722 2.5822 1.7665 1.8071 1.9953 1.8357 2.0729 2.5447 1.0563 1.0595 4.6696 1.1964 1.2104 1.8826 1.6369 1.3728 1.2552 1.2131 1.1455 1.0710 1.2752 2.5203 1.3803 1.4633 1.6840 1.4960 1.4109 1.5549 1.4801 6.4277 7.1105 1.2168 1.2305 2.3202 2.3145 1.0728 1.0707 1.0710 1.1555 1.8504 1.0438 1.0806 2.3564 1.0694 1.0547 1.0761 9.9619 5.6617 5.9697 5.9703 6.6028 10.0947 12.6386 1.0590 1.0594 1.0603 1.0792 1.0361 1.0380 1.0842 1.0777 1.0578 1.1004 1.1040 1.0995 1.1029 1.1007 1.1025 1.0995 1.0997 1.0855 1.0852 1.0876 1.0881 1.0922 1.0926 1.0966 1.0965 1.1016 1.1012
irintensity: 0.0074 0.3914 1.0533 1.1944 0.2529 0.4241 0.2473 0.0740 0.5408 0.7264 0.1553 0.0977 0.4686 0.2882 0.9976 2.1603 1.2580 1.2930 0.1645 0.0867 0.2120 0.1498 5.1246 1.2181 2.4574 4.1276 6.8289 1.5154 2.0026 1.2927 1.6128 0.1133 3.2493 5.2872 4.5577 0.6516 0.5198 3.4280 3.0967 7.4291 1.2329 3.0204 13.7889 3.9406 38.7286 47.9849 14.2151 10.9183 35.6827 8.1166 28.0670 25.1015 28.2650 10.2489 6.6837 3.4545 2.6900 10.1902 1.7541 2.2332 29.0889 3.4428 15.6505 3.1577 12.1934 1.9465 1.2723 5.2562 3.3030 34.6706 1.9695 0.0915 3.3384 1.6216 8.2369 5.0895 250.0195 68.0565 96.1518 64.6063 17.9863 0.9809 7.9214 8.7337 0.1996 1.9329 155.0253 5.4013 28.9598 116.7769 91.6973 14.1145 8.4093 1.2174 1.8736 0.9470 0.0840 44.7236 2.4242 2.2150 26.4647 1.4594 2.1689 0.1665 0.4018 1.4203 2.0785 12.0298 16.8745 2.4907 20.0240 0.6139 0.9915 0.9531 2.6837 16.9855 12.5628 22.5010 1.1287 21.6824 12.3117 2.5450 204.3466 0.5184 8.5996 17.9282 23.3110 142.5781 26.4937 7.2245 1.5551 74.7595 12.7787 41.6871 21.3146 10.2082 38.2948 20.3041 6.2144 64.4017 7.9880 54.7486 96.8071 33.7161 59.8699 61.8488 1.6228 0.3511 0.1063 2.3158 13.5466 18.7910 28.8447 22.2825 25.3964 18.6979
temp: 298.150 k
press: 1.00000 atm
elementType: 8 8 7 6 6 6 6 6 6 6 6 6 6 6 6 6 6 6 6 6 6 6 6 6 6 6 6 1 1 1 1 1 1 1 1 1 1 1 1 1 1 1 1 1 1 1 1 1 1 1 1 1 1 1
symmnumber: 1
zpe: 1168320.0 jmol-1
zpe.correction: 0.444990 hartree
zpe.thermalcorrener: 0.471754 hartree
zpe.thermalcorrenthalpy: 0.472698 hartree
zpe.thermalcorrgfe: 0.383433 hartree
zpe.sumelectzpe: -1133.962922 hartree
zpe.sumelectthermal: -1133.936158 hartree
zpe.sumelectthermalent: -1133.935214 hartree
zpe.sumelectthermalfe: -1134.024479 hartree
dipole: -1.6203 3.1404 0.5693
dipole: 3.5793
quadrupole: -126.4291 -162.3692 -161.9646
quadrupole: 1.0083 -1.1553 9.0519
quadrupole: 23.8252 -12.1149 -11.7103 1.0083 -1.1553 9.0519
hfenergy: -1134.4079121 hartree
pointgroup: C01 [X(C24H27N1O2)]
dipole: -0.4801178 -1.3170142 -0.1343545 debye
polarizability: 370.8466131|7.0327318|312.8643742|4.5612884|-1.3247627|186.2303777 unknown
InChI: InChI=1S/C24H27NO2/c1-3-5-12-19(4-2)18-27-24(26)22(17-25)23(20-13-8-6-9-14-20)21-15-10-7-11-16-21/h6-11,13-16,19H,3-5,12,18H2,1-2H3
charge 0 multiplicity 1
54 atoms
O  1.408409 0.651348 0.197775
O  0.402532 -0.947949 1.567055
N  -0.833427 3.023469 -0.626843
C  3.813297 0.817485 -0.224605
C  5.214605 0.630311 0.422931
C  3.674591 0.180203 -1.636656
C  6.382087 1.196403 -0.416418
C  2.749787 0.291655 0.750926
C  7.740888 1.114788 0.316496
C  3.946305 -1.340118 -1.70758
C  8.91364 1.65317 -0.531203
C  0.311576 -0.041341 0.70615
C  -0.9642 0.498937 0.116662
C  -2.127321 -0.266058 0.013556
C  -2.084551 -1.753097 0.102193
C  -3.452686 0.357431 -0.251646
C  -1.113052 -2.495755 -0.623667
C  -3.829634 1.584769 0.364749
C  -3.051849 -2.458143 0.869593
C  -4.38741 -0.287154 -1.112607
C  -0.915794 1.878753 -0.283909
C  -1.096709 -3.903037 -0.567702
C  -5.095447 2.15252 0.11959
C  -3.023446 -3.866302 0.940157
C  -5.646929 0.29159 -1.369729
C  -2.046801 -4.594263 0.221109
C  -6.006761 1.513289 -0.7539
H  3.638275 1.907693 -0.341621
H  5.216921 1.13205 1.413701
H  5.398999 -0.445397 0.624385
H  4.364037 0.703026 -2.326941
H  2.652834 0.389791 -2.00552
H  6.169727 2.25433 -0.677597
H  6.458982 0.647397 -1.376423
H  2.837376 0.768933 1.744994
H  2.79277 -0.804221 0.886755
H  7.677806 1.682805 1.267177
H  7.940246 0.060291 0.59791
H  3.250938 -1.915147 -1.067697
H  4.976335 -1.58856 -1.392394
H  3.818958 -1.705689 -2.742962
H  9.019547 1.078762 -1.470904
H  8.751782 2.713243 -0.803536
H  9.872563 1.587251 0.014977
H  -0.38687 -1.964049 -1.249297
H  -3.140572 2.079078 1.056637
H  -3.808242 -1.896623 1.428436
H  -4.112418 -1.232025 -1.59291
H  -0.348088 -4.461441 -1.140109
H  -5.371609 3.091955 0.609944
H  -3.761145 -4.394971 1.553425
H  -6.34649 -0.208215 -2.048345
H  -2.029459 -5.688719 0.269666
H  -6.987807 1.960448 -0.948829
