program: Gaussian 09
title: 000282097
version: EM64L-G09RevD.01
frameworkgroup: C1[X(C14H9NO)]
method: RPBEPBE
basis: SDD
operation: Freq
keyword: #p
keyword: freq=noraman
keyword: PBEPBE/SDD
title: #p freq=noraman PBEPBE/SDD
converged: NO YES NO NO
title: Mulliken charges:
elementType: O N C C C C C C C C C C C C C C H H H H H H H H H
charge: -0.197794 -0.255582 0.328849 0.467916 0.241371 0.211885 -0.371075 -0.263919 -0.375993 -0.372692 -0.386909 -0.377491 -0.224217 -0.253485 -0.232196 -0.233411 0.300033 0.225425 0.290737 0.294309 0.236506 0.238015 0.238400 0.242416 0.228902
chargesum: 0.00000
title: Mulliken charges with hydrogens summed into heavy atoms:
elementType: O N C C C C C C C C C C C C C C
charge: -0.197794 -0.026680 0.328849 0.467916 0.241371 0.211885 -0.371075 -0.263919 -0.075960 -0.147267 -0.096172 -0.083182 0.012289 -0.015470 0.006203 0.009005
polarizability: 2.42797715e+02 3.47938040e-01 1.87444954e+02 -3.04268335e-03 5.22912308e-03 5.96895238e+01
1716.lowfreq: -10.7980 -9.6738 -0.0008 -0.0006 -0.0005 6.4792 33.9115 102.4181 120.4618
frequency: 33.8878 102.4171 120.4611 158.3060 232.3228 233.1439 311.5282 359.2725 391.3075 400.3632 416.8283 418.6494 437.1088 474.4651 498.1966 602.3329 617.6489 651.6599 656.4693 672.5513 698.7072 721.6254 776.2970 781.2284 819.4746 856.5415 871.1690 878.5040 908.7319 919.2760 970.6478 983.1046 1001.7610 1014.5721 1019.6765 1032.5681 1040.8605 1084.3826 1091.9826 1143.9551 1162.9620 1174.7088 1179.2872 1183.0764 1230.3846 1272.3332 1312.2133 1341.1756 1387.7635 1400.9746 1433.3771 1452.8974 1469.0601 1473.1158 1535.9006 1549.9984 1572.2065 1602.0685 1605.8607 1619.7770 3120.0567 3134.8065 3141.6030 3151.5146 3156.1259 3165.8885 3170.5427 3175.5846 3338.5627
redmass: 6.0865 4.0613 4.4871 6.2129 4.8071 4.8216 6.2536 7.0801 6.4558 3.2469 4.8262 7.5235 3.0321 9.7887 3.6131 6.3784 6.5309 3.9990 6.0184 6.1402 2.0930 2.8727 1.2249 6.4521 1.9555 1.4557 1.4415 3.9684 1.4641 6.8311 2.3901 1.5663 1.3885 1.3851 1.4505 2.2630 1.9987 3.2565 2.2176 1.5792 1.7713 1.0903 2.1844 1.2444 1.4932 1.5229 2.9146 2.4623 10.5872 10.1362 2.3163 2.9146 2.6728 2.5570 8.0416 7.9617 6.9575 7.7450 6.3920 6.9287 1.0875 1.0864 1.0887 1.0909 1.0933 1.0960 1.1002 1.0979 1.0751
irintensity: 4.5840 0.2487 1.0446 0.0114 0.8782 1.2770 4.3932 0.4975 20.2394 1.7063 0.9050 0.9520 2.2961 0.6606 0.9978 0.3036 7.7218 0.4444 8.0522 0.0550 54.5609 55.4829 1.0538 0.8809 86.9925 37.9652 10.1278 32.5039 1.5585 30.3341 2.0860 1.0262 5.8518 1.9669 0.0654 1.3865 10.0563 0.3964 1.5695 52.0558 5.6624 8.8435 54.2543 4.1283 11.2379 6.8341 239.5741 194.7292 0.8263 4.5980 0.2042 7.5063 0.4468 1.6473 23.6490 174.8636 2.8205 14.9708 4.8678 0.5570 4.3730 5.1145 7.9734 9.7165 5.8962 11.9553 29.4317 16.7871 10.4231
temp: 298.150 k
press: 1.00000 atm
elementType: 8 7 6 6 6 6 6 6 6 6 6 6 6 6 6 6 1 1 1 1 1 1 1 1 1
symmnumber: 1
zpe: 495958.7 jmol-1
zpe.correction: 0.188901 hartree
zpe.thermalcorrener: 0.200341 hartree
zpe.thermalcorrenthalpy: 0.201285 hartree
zpe.thermalcorrgfe: 0.150934 hartree
zpe.sumelectzpe: -667.802437 hartree
zpe.sumelectthermal: -667.790997 hartree
zpe.sumelectthermalent: -667.790053 hartree
zpe.sumelectthermalfe: -667.840404 hartree
dipole: 1.5688 1.7787 0.0089
dipole: 2.3718
quadrupole: -66.6170 -96.7128 -96.4694
quadrupole: 4.7410 -0.0042 0.0093
quadrupole: 19.9827 -10.1130 -9.8697 4.7410 -0.0042 0.0093
hfenergy: -667.991338 hartree
pointgroup: C01 [X(C14H9N1O1)]
dipole: -0.6214453 -0.6960408 0.0066286 debye
dipolederiv: -0.6828613 0.0035987 0.0000159 0.0425579 -0.9919478 0.003803 -0.000235 0.0034253 -0.3141107 -0.3557639 0.062943 -0.0004148 -0.0572225 -0.7984235 0.0007348 -0.0005735 0.0011592 -0.3978408 -0.2157135 -0.0765287 0.0003153 -0.2673672 -0.0103718 0.0000235 0.0020127 0.0009422 0.0256018 -0.276516 0.0677641 -0.0004995 0.2591471 -0.0594869 0.0004286 -0.001135 0.0014852 0.0934842 -0.6134048 0.2879476 -0.0015046 0.3795676 -0.1706522 0.0012062 -0.0022646 0.0005375 0.0092741 -0.5371833 -0.2277374 0.0013869 -0.2997735 -0.1532993 0.0011235 0.0015676 0.0004385 0.0252243 1.0332488 0.0619702 -0.0002343 0.0704985 0.5215567 -0.0009975 -0.0010737 -0.0027057 0.0165288 1.6884121 -0.02778 0.0002123 -0.0584937 1.0250096 -0.0053434 0.0007581 -0.0046386 0.1161105 -0.2747403 0.0445418 -0.0003245 -0.0818775 0.075856 -0.0009857 0.0001014 -0.0009899 -0.1189339 -0.219275 -0.0142209 0.0001944 0.0884511 0.0920675 -0.0015308 0.0000631 -0.0015211 -0.139331 -0.0812634 -0.1788957 0.0007364 0.1158926 0.0813835 -0.0005658 -0.0005931 -0.0005481 -0.1121263 -0.0857852 0.1493493 -0.0007259 -0.1024657 0.090093 -0.0008382 0.0003358 -0.0005859 -0.109466 0.1591792 -0.1002443 0.0006534 -0.0742455 0.0398547 -0.0007426 0.0003471 -0.0007492 -0.1398465 0.1228333 0.0826452 -0.0009646 0.093455 0.0271779 -0.0011019 -0.0013895 -0.0011297 -0.1331869 0.1071985 0.1690269 -0.0005598 0.1111696 -0.0984181 -0.0002484 -0.0005717 -0.0002968 -0.1510263 0.0947098 -0.1580618 0.000995 -0.1314241 -0.0749791 -0.0006484 0.0015879 -0.0006816 -0.1516099 0.1526128 -0.0245625 0.0001414 0.0398257 0.0094997 0.0007314 0.0000064 0.0007027 0.1545727 0.1208791 0.0517881 -0.0002443 -0.0323143 -0.0964861 0.0014887 0.0001778 0.0012418 0.1460391 0.1317114 0.0371489 -0.0001881 -0.0358393 -0.0020423 0.0005166 0.0002218 0.0005707 0.1569406 0.1423651 -0.0386457 0.000211 0.0355673 0.0060869 0.0006893 -0.0003574 0.0006419 0.1551181 -0.0849027 0.0800044 -0.0004639 0.0962177 0.0461054 0.0005041 -0.0005201 0.0005589 0.1539136 -0.0776422 -0.0749401 0.0007048 -0.0948621 0.0478024 0.0007785 0.0008588 0.0008609 0.1583198 -0.0859858 -0.082211 0.0002337 -0.0965048 0.0444819 0.0004227 0.0004006 0.0004159 0.1586328 -0.0749454 0.0805065 -0.0004788 0.0922747 0.045093 0.0006852 -0.0006841 0.0006939 0.1600063 -0.0871673 -0.1754064 0.0008024 -0.0922348 0.3040386 -0.0001335 0.0009587 0.000172 0.2377116 unknown
polarizability: 242.7998987|0.0132542|187.4401882|0.0008855|-0.5743064|59.6921053 unknown
InChI: InChI=1S/C14H9NO/c15-13-9-5-1-3-7-11(9)14(16)12-8-4-2-6-10(12)13/h1-8,15H
charge 0 multiplicity 1
25 atoms
O  -0.001076 2.755704 -0.01713
N  0.087304 -2.811398 0.006353
C  1.267125 -0.720387 -0.000013
C  -1.297328 -0.714294 0.00062
C  1.271782 0.70574 -0.00602
C  -1.28055 0.712375 -0.006608
C  -0.012243 -1.495276 0.001796
C  0.00158 1.482162 -0.010748
C  2.505974 -1.412689 0.00385
C  -2.554628 -1.374152 0.005856
C  2.502774 1.412825 -0.007754
C  -2.497061 1.44149 -0.009806
C  3.721842 -0.703857 0.001757
C  -3.759141 -0.645313 0.002765
C  3.723249 0.715769 -0.003949
C  -3.733145 0.772042 -0.00552
H  2.479552 -2.505697 0.008597
H  -2.60611 -2.469183 0.012286
H  2.464673 2.506628 -0.011815
H  -2.433785 2.534239 -0.014963
H  4.671012 -1.250858 0.004506
H  -4.716857 -1.17659 0.007067
H  4.671212 1.264191 -0.00588
H  -4.669801 1.338917 -0.00911
H  -0.830958 -3.299389 0.009159
