program: Gaussian 09
title: 000282114
version: EM64L-G09RevD.01
frameworkgroup: C1[X(C15H10Br2O2)]
method: RPBEPBE
basis: SDD
operation: Freq
keyword: #p
keyword: freq=noraman
keyword: PBEPBE/SDD
title: #p freq=noraman PBEPBE/SDD
converged: YES YES NO NO
title: Mulliken charges:
elementType: Br Br O O C C C C C C C C C C C C C C C H H H H H H H H H H
charge: 0.016360 0.069316 -0.397250 -0.207176 -0.556555 0.451180 0.356771 0.158851 0.165991 -0.541767 -0.382317 -0.363149 -0.390073 -0.401891 -0.250571 -0.253819 -0.227244 -0.224629 0.266327 0.350801 0.246843 0.307005 0.246165 0.243919 0.232509 0.232152 0.231853 0.230235 0.390164
chargesum: 0.00000
title: Mulliken charges with hydrogens summed into heavy atoms:
elementType: Br Br O O C C C C C C C C C C C C C C C
charge: 0.016360 0.069316 -0.007086 -0.207176 -0.556555 0.451180 0.356771 0.158851 0.165991 -0.190966 -0.135474 -0.056144 -0.143908 -0.157972 -0.018062 -0.021667 0.004609 0.005606 0.266327
polarizability: 2.15927618e+02 1.16989972e+01 2.41350553e+02 2.66676895e+01 -9.60878101e+00 1.65216717e+02
1716.lowfreq: -0.0007 -0.0005 0.0003 3.7378 6.2228 7.9814 42.6274 44.8484 61.1687
frequency: 42.5969 44.8275 61.1670 76.4465 91.4450 101.7219 132.2875 141.7580 152.5148 167.3104 200.7212 229.3402 234.6627 301.3208 311.8793 413.0374 417.8298 443.2324 469.6548 500.2396 509.5678 563.0387 567.6156 577.1233 617.4662 630.7032 647.6613 671.4312 708.3359 730.2988 750.1278 758.2347 767.0146 798.3210 804.6930 854.4384 883.2047 895.5592 921.3585 952.1784 969.6390 989.9349 997.1054 1001.4967 1022.6920 1027.6816 1034.7274 1068.5870 1107.7410 1122.3916 1143.2088 1169.8675 1178.5080 1188.7359 1234.6224 1252.7182 1255.6725 1298.3174 1305.6614 1360.9161 1375.4093 1410.0403 1440.8594 1445.8698 1465.0604 1492.5362 1591.8959 1599.1155 1615.2334 1616.6879 1670.2004 3116.0096 3127.2358 3129.3551 3134.5441 3143.2802 3148.8190 3161.1656 3167.0428 3184.4234 3520.3503
redmass: 8.5577 8.0218 9.4103 10.3586 5.7216 9.8854 10.3001 7.0777 3.8662 19.6808 6.3852 9.2781 6.5779 4.2611 6.9852 6.4540 3.1459 4.8610 3.2355 3.7174 4.7562 4.1586 4.6025 4.5837 6.9435 1.6822 3.8368 4.8808 5.9030 5.3811 1.9495 1.9169 2.1315 2.3602 3.2404 6.1989 1.5172 1.5204 4.9963 1.4526 1.4004 1.3515 5.3206 1.4046 3.6427 2.4142 2.1699 2.4768 1.9207 1.7535 1.2104 1.2326 1.0851 1.6655 2.7224 2.3861 1.5682 1.5557 1.8880 2.1017 5.0081 3.2928 2.2371 2.7647 2.5242 4.2736 6.6757 6.9680 7.2447 7.0010 8.8676 1.0860 1.0868 1.0862 1.0891 1.0916 1.0943 1.0977 1.1002 1.0959 1.0642
irintensity: 0.3756 0.6653 1.2013 0.6331 1.9168 1.7304 1.2165 1.5989 0.3950 0.7388 1.2889 0.8939 5.9273 0.2317 2.6294 0.3088 0.8076 27.2922 0.3208 3.1478 0.2296 10.3010 8.8181 67.8216 4.5574 253.8750 5.2096 2.3778 4.4663 16.2417 123.1475 16.3210 20.8162 3.0430 12.6779 14.8980 1.9395 0.6496 0.6956 0.3063 2.3810 0.2921 5.4408 1.6704 90.2124 125.8870 4.8997 81.2122 11.1760 2.5850 11.7524 3.0344 2.2173 1.9042 18.0238 12.3655 7.7054 23.9924 0.5690 46.1804 11.7378 0.7018 43.1044 9.6438 4.7746 0.7314 2.0116 0.9389 10.9889 9.1789 185.8965 0.2653 3.7532 2.1726 4.3609 11.9462 20.8367 29.3405 28.1168 16.5707 51.8703
temp: 298.150 k
press: 1.00000 atm
elementType: 35 35 8 8 6 6 6 6 6 6 6 6 6 6 6 6 6 6 6 1 1 1 1 1 1 1 1 1 1
symmnumber: 1
zpe: 540877.9 jmol-1
zpe.correction: 0.206010 hartree
zpe.thermalcorrener: 0.222682 hartree
zpe.thermalcorrenthalpy: 0.223627 hartree
zpe.thermalcorrgfe: 0.159677 hartree
zpe.sumelectzpe: -753.667682 hartree
zpe.sumelectthermal: -753.651009 hartree
zpe.sumelectthermalent: -753.650065 hartree
zpe.sumelectthermalfe: -753.714015 hartree
dipole: -1.1762 -0.8136 -0.6499
dipole: 1.5709
quadrupole: -106.2669 -115.7911 -136.6912
quadrupole: -2.4607 5.2826 -2.7796
quadrupole: 13.3161 3.7920 -17.1081 -2.4607 5.2826 -2.7796
hfenergy: -753.8736918 hartree
pointgroup: C01 [X(C15H10Br2O2)]
dipole: -0.5605841 0.0301681 0.2585006 debye
polarizability: 232.0886956|-15.2862604|228.4303125|-19.8129181|-16.0921105|161.9758799 unknown
InChI: InChI=1S/C15H10Br2O2/c16-13(14(18)19)15(17)11-7-3-1-5-9(11)10-6-2-4-8-12(10)15/h1-8,13,18H
charge 0 multiplicity 1
29 atoms
Br 0.736417 1.101557 -2.432724
Br 1.061631 1.253403 2.362264
O  3.001004 3.114013 0.065667
O  3.508624 0.861624 -0.171238
C  0.350362 0.564424 -0.406599
C  -1.152019 0.71305 -0.200189
C  0.591541 -0.930967 -0.246921
C  -1.733402 -0.568388 0.014438
C  -0.660987 -1.581852 -0.02082
C  1.177469 1.617487 0.343144
C  -1.938846 1.876079 -0.198643
C  1.782539 -1.676331 -0.311091
C  -3.11956 -0.692375 0.231646
C  -0.725908 -2.978464 0.142822
C  -3.33278 1.752125 0.023367
C  1.713238 -3.082303 -0.144839
C  -3.916148 0.478537 0.234522
C  0.473353 -3.728147 0.077491
C  2.667884 1.756784 0.041497
H  0.71221 2.607903 0.242193
H  -1.500975 2.862715 -0.388485
H  2.739916 -1.179771 -0.482798
H  -3.577885 -1.672504 0.402056
H  -1.683412 -3.479871 0.321076
H  -3.964704 2.646487 0.026075
H  2.633187 -3.674936 -0.191569
H  -4.996026 0.40075 0.402154
H  0.442404 -4.816459 0.200738
H  3.978073 3.219331 -0.094532
