program: Gaussian 09
title: 000282107
version: EM64L-G09RevD.01
frameworkgroup: C1[X(C14H12N2O3)]
method: RPBEPBE
basis: SDD
operation: Freq
keyword: #p
keyword: freq=noraman
keyword: PBEPBE/SDD
title: #p freq=noraman PBEPBE/SDD
converged: YES YES NO NO
title: Mulliken charges:
elementType: O O O N N C C C C C C C C C C C C C C H H H H H H H H H H H H
charge: -0.273889 -0.210275 -0.207874 -0.393637 0.027115 -0.530518 0.528525 -0.428055 -0.335535 0.266222 0.180206 0.378551 -0.353074 -0.361281 -0.349057 -0.354491 -0.221061 -0.235092 -0.224377 0.275994 0.236522 0.306228 0.244932 0.266837 0.286723 0.287313 0.276099 0.213896 0.235493 0.232007 0.235554
chargesum: 0.00000
title: Mulliken charges with hydrogens summed into heavy atoms:
elementType: O O O N N C C C C C C C C C C C C C C
charge: -0.273889 -0.210275 -0.207874 -0.087409 0.027115 -0.018002 0.528525 -0.183122 -0.068698 0.266222 0.180206 0.378551 -0.066351 -0.073968 -0.072958 -0.140595 0.014432 -0.003085 0.011177
polarizability: 2.63649908e+02 -1.53064256e+01 1.51216961e+02 -9.58505094e+00 1.88476828e+01 1.35900901e+02
1716.lowfreq: -6.8058 -0.0005 0.0002 0.0004 3.0008 6.1799 12.8788 25.2444 27.3648
frequency: 11.5464 25.1304 27.1552 48.9271 68.2682 90.5765 134.2342 158.6542 178.2874 235.0091 266.0803 290.6465 325.0367 370.3595 401.8669 408.3837 417.4236 424.7983 478.5555 503.5419 541.7819 573.6155 614.6911 623.4526 628.8815 659.0347 672.4262 688.1936 703.1388 730.3578 764.6148 792.5263 798.2558 825.2477 852.5334 855.0814 859.4811 936.5296 976.9341 985.7126 988.2262 990.6453 996.6331 1006.4035 1007.9031 1025.3894 1042.4778 1085.5328 1092.2969 1112.7172 1143.1443 1174.8144 1181.7187 1191.5016 1212.0004 1222.1102 1238.9668 1268.6903 1302.2341 1317.5715 1347.3408 1369.1148 1385.7087 1403.8968 1421.5688 1433.4513 1454.3799 1469.6571 1481.5451 1496.7269 1571.4668 1597.5411 1605.0920 1609.3062 1611.4560 2986.4086 3042.0138 3118.9758 3134.0842 3136.7042 3147.0462 3153.0082 3159.7509 3171.3105 3182.2560 3184.8720 3562.1618
redmass: 5.1151 6.2024 6.1109 5.8663 7.0743 6.7351 4.7998 4.6073 7.1986 6.0753 5.1807 6.3544 3.4057 5.2937 2.8227 2.8826 5.8460 3.4417 3.8343 7.1468 3.2736 1.3385 6.2304 5.9998 5.3161 5.8231 4.5012 4.9262 1.5460 4.5876 6.0609 2.5292 4.1094 4.3066 1.2643 1.2514 1.6367 1.4364 2.2108 1.4358 2.0796 3.0465 1.4251 2.9084 1.3463 2.3163 2.7981 1.5954 3.2952 1.3263 2.9687 1.0586 1.3375 1.1412 2.6409 5.9159 1.2459 2.2321 1.3135 1.3289 1.6932 4.5096 9.1582 7.0350 2.9737 2.2054 1.1680 1.9312 2.3036 2.1416 6.2075 7.6166 6.5745 6.1734 6.0501 1.0587 1.1022 1.0874 1.0871 1.0904 1.0919 1.0903 1.0957 1.1008 1.0943 1.0957 1.0775
irintensity: 1.9503 1.7854 0.1057 5.8972 0.1994 1.6304 0.6592 2.5092 5.3203 2.3258 0.5871 7.1146 8.5311 6.3123 0.9844 1.0018 6.8313 6.1615 5.1717 1.3071 32.1862 106.0524 1.8148 2.0817 2.6612 8.5062 24.4960 3.9137 102.5984 9.7349 32.8213 29.1094 5.4463 2.2742 2.9604 0.5699 48.0849 3.4395 24.7884 1.3006 1.0006 5.5408 0.4147 9.7126 1.1077 4.2390 3.9579 22.7562 16.2535 24.4726 9.9601 1.4793 67.3801 17.4115 17.0956 334.0910 12.1417 199.1848 22.7270 0.5985 12.5085 88.5992 1.5634 2.5095 73.7171 6.8430 36.8138 107.5338 4.2090 174.3186 85.1120 1.7353 58.1855 67.0016 8.8079 51.5701 27.2060 11.4058 1.6797 10.5418 20.2419 3.1606 14.9561 20.2435 0.1999 3.2862 12.5608
temp: 298.150 k
press: 1.00000 atm
elementType: 8 8 8 7 7 6 6 6 6 6 6 6 6 6 6 6 6 6 6 1 1 1 1 1 1 1 1 1 1 1 1
symmnumber: 1
zpe: 614789.6 jmol-1
zpe.correction: 0.234161 hartree
zpe.thermalcorrener: 0.250350 hartree
zpe.thermalcorrenthalpy: 0.251294 hartree
zpe.thermalcorrgfe: 0.186405 hartree
zpe.sumelectzpe: -874.462181 hartree
zpe.sumelectthermal: -874.445992 hartree
zpe.sumelectthermalent: -874.445048 hartree
zpe.sumelectthermalfe: -874.509937 hartree
dipole: 5.3067 1.9410 3.3598
dipole: 6.5739
quadrupole: -133.2531 -107.9796 -109.1534
quadrupole: -22.2065 8.9727 7.4650
quadrupole: -16.4577 8.8158 7.6420 -22.2065 8.9727 7.4650
hfenergy: -874.6963421 hartree
pointgroup: C01 [X(C14H12N2O3)]
dipole: -2.1528201 -0.648226 1.2785007 debye
polarizability: 262.1128019|-15.5985475|149.302998|15.3505474|-20.4731829|139.35197 unknown
InChI: InChI=1S/C14H12N2O3/c17-14(12-4-2-1-3-5-12)15-10-11-6-8-13(9-7-11)16(18)19/h1-9,15H,10H2
charge 0 multiplicity 1
31 atoms
O  -1.889278 -1.163071 -1.913845
O  6.054091 0.386143 0.937227
O  5.128119 2.101192 -0.248012
N  -1.124509 -1.208286 0.279489
N  5.068656 0.937233 0.308908
C  0.063025 -2.007337 -0.053237
C  1.369398 -1.229631 0.061815
C  2.482707 -1.784325 0.742445
C  1.492712 0.052143 -0.538414
C  -3.259301 -0.077737 -0.220712
C  -2.057726 -0.854525 -0.690585
C  3.791639 0.188105 0.22215
C  3.702058 -1.08328 0.827834
C  2.700836 0.768387 -0.464551
C  -3.993121 0.639337 -1.200357
C  -3.696688 -0.052429 1.130159
C  -5.129585 1.389002 -0.834318
C  -4.837684 0.695048 1.495094
C  -5.55268 1.422766 0.515639
H  -0.089231 -2.335657 -1.099982
H  0.100899 -2.911357 0.583626
H  -1.218288 -0.847595 1.229469
H  2.395873 -2.772103 1.2098
H  0.63669 0.478226 -1.071916
H  4.571397 -1.492326 1.349136
H  2.818883 1.752747 -0.924938
H  -3.655238 0.584993 -2.240324
H  -3.183991 -0.641359 1.900664
H  -5.686559 1.943313 -1.597313
H  -5.174072 0.70235 2.537504
H  -6.437132 2.002931 0.800945
