program: Gaussian 09
title: 000282121
version: EM64L-G09RevD.01
frameworkgroup: C1[X(C12H16N4O5)]
method: RPBEPBE
basis: SDD
operation: Freq
keyword: #p
keyword: freq=noraman
keyword: PBEPBE/SDD
title: #p freq=noraman PBEPBE/SDD
converged: YES YES NO NO
title: Mulliken charges:
elementType: O O O O O N N N N C C C C C C C C C C C C H H H H H H H H H H H H H H H H
charge: -0.263242 -0.274095 -0.297742 -0.292823 -0.319006 -0.436325 -0.075207 -0.642541 -0.610420 -0.149953 -0.133836 -0.152651 0.338405 -0.363451 0.391174 -0.690165 -0.694730 -0.104208 -0.033280 0.147024 0.195109 0.289360 0.247421 0.291590 0.257002 0.209343 0.221291 0.215340 0.268944 0.242231 0.215558 0.222149 0.366107 0.392241 0.322199 0.362105 0.339082
chargesum: 0.00000
title: Mulliken charges with hydrogens summed into heavy atoms:
elementType: O O O O O N N N N C C C C C C C C C C C C
charge: -0.263242 -0.274095 -0.297742 -0.292823 -0.319006 -0.070218 -0.075207 0.071899 0.090766 0.139407 0.113585 0.138939 0.338405 0.102893 0.391174 0.015410 -0.014793 -0.104208 -0.033280 0.147024 0.195109
polarizability: 2.35549595e+02 4.52696638e+00 1.72422464e+02 -1.24001978e+01 -1.68160322e-01 1.07075645e+02
1716.lowfreq: -8.6518 -5.1490 -0.0008 0.0004 0.0005 4.5898 29.3138 33.3130 49.6185
frequency: 29.1270 33.2909 49.6083 72.0769 82.2660 107.1736 110.4943 145.4262 164.2006 169.6180 212.8374 235.9724 237.3938 252.3233 273.9586 276.7792 316.0528 341.0646 354.9347 372.6935 378.9874 393.2915 414.8692 484.0808 501.6589 545.1982 579.7586 596.9512 599.1835 619.2705 637.2815 650.6009 657.5343 668.1297 688.5143 711.3421 719.5132 736.1285 740.8595 780.9873 788.4830 812.2266 823.7003 844.5934 847.4079 887.5874 898.5270 921.8549 932.5866 960.3352 987.2166 998.9756 1006.8392 1017.3680 1047.4803 1073.6716 1078.5151 1099.9486 1132.1858 1140.8687 1165.2294 1167.1426 1185.9647 1204.2885 1224.8493 1246.2070 1256.6538 1259.3269 1260.0800 1294.0523 1316.2879 1329.5073 1331.0863 1352.6312 1380.4291 1380.9653 1394.1175 1430.9914 1451.7445 1455.6146 1458.9471 1473.6555 1474.8462 1484.8933 1526.7576 1562.2815 1585.6548 1611.7240 1660.0223 2962.2700 2990.5576 3007.0428 3060.8795 3069.9525 3093.9858 3098.2452 3104.9272 3109.5440 3119.0655 3121.1380 3160.6805 3504.3850 3573.2897 3601.9665 3670.2730
redmass: 4.7916 5.1286 6.4404 4.4732 5.9686 4.0162 6.6964 6.0430 1.2483 3.5597 3.5378 5.7367 4.8036 1.0957 5.9443 4.4088 5.4164 2.6613 5.4936 5.3929 2.8872 3.4188 4.1497 3.9689 6.2984 1.5763 3.9925 3.5438 1.9459 4.2100 3.3995 1.9890 1.4949 2.8240 5.2093 3.9253 7.5110 5.6499 7.6981 1.8129 2.3172 5.3511 3.7383 3.2296 7.0423 2.9348 1.0727 1.7695 2.7398 2.2755 1.3086 4.6863 5.0309 3.2821 2.7019 2.5813 2.0321 4.4694 2.1324 1.8501 1.9834 1.9978 1.3349 2.6632 1.4217 1.4329 2.1782 1.6048 2.8579 4.8086 1.2076 1.2989 1.3636 2.8171 2.0789 1.9550 1.2168 4.1764 1.0515 1.0705 1.0735 1.0696 4.8956 1.0483 6.1860 2.3453 2.3467 2.9356 1.5122 1.0685 1.0352 1.0355 1.0879 1.0859 1.0998 1.1012 1.0967 1.0995 1.0884 1.1009 1.0733 1.0458 1.0818 1.0852 1.1042
irintensity: 0.0556 0.8293 0.4671 0.2321 1.1968 1.3169 7.9033 9.4879 0.6720 14.2278 2.1058 16.4950 11.3903 0.9259 7.8671 7.2657 0.4739 2.0606 5.0389 4.7539 0.3605 5.6282 1.8305 13.1844 35.0401 39.5707 24.0913 20.6996 88.0450 10.9445 63.5238 86.2762 25.5075 16.1721 16.2493 36.1109 14.6503 20.8960 33.7867 49.3417 14.2137 47.8681 49.1735 18.9295 7.0146 5.7208 166.2763 6.8321 33.9177 2.3868 1.3308 105.9323 61.6269 76.1610 31.7597 19.9852 1.9968 33.8683 7.2152 35.0969 7.4275 5.4151 21.4538 102.1641 10.7035 0.5245 127.6655 26.7637 13.2169 36.9673 1.8520 9.3773 6.3531 5.1076 55.8450 12.2977 37.3450 168.0904 6.3604 0.2743 13.7883 0.4844 43.1001 9.9071 36.9173 152.6001 469.0847 374.1911 61.1549 54.0493 18.8385 16.4373 25.8985 2.1820 7.8891 8.2750 13.9085 26.4618 9.0974 20.0897 545.1074 53.9181 118.2753 71.2431 73.0430
temp: 298.150 k
press: 1.00000 atm
elementType: 8 8 8 8 8 7 7 7 7 6 6 6 6 6 6 6 6 6 6 6 6 1 1 1 1 1 1 1 1 1 1 1 1 1 1 1 1
symmnumber: 1
zpe: 756135.3 jmol-1
zpe.correction: 0.287997 hartree
zpe.thermalcorrener: 0.307257 hartree
zpe.thermalcorrenthalpy: 0.308201 hartree
zpe.thermalcorrgfe: 0.239927 hartree
zpe.sumelectzpe: -1060.444755 hartree
zpe.sumelectthermal: -1060.425495 hartree
zpe.sumelectthermalent: -1060.424551 hartree
zpe.sumelectthermalfe: -1060.492825 hartree
dipole: -1.5571 -4.5775 0.8878
dipole: 4.9159
quadrupole: -110.9371 -118.5879 -123.3707
quadrupole: 7.8281 -2.5157 -0.2652
quadrupole: 6.6948 -0.9560 -5.7388 7.8281 -2.5157 -0.2652
hfenergy: -1060.7327516 hartree
pointgroup: C01 [X(C12H16N4O5)]
dipole: 0.5433144 -1.8185941 0.3716382 debye
polarizability: 231.9303293|-14.9893654|162.9944094|-19.7136718|-22.4931423|120.1229649 unknown
InChI: InChI=1S/C12H16N4O5/c1-12(2)20-4-3-19-9(8(4)21-12)6-5(10(13)17)7(11(14)18)16-15-6/h4,8-9,15H,3,13-14H2,1-2H3
charge 0 multiplicity 1
37 atoms
O  -2.764678 1.350204 -0.328774
O  -3.954059 -0.642551 -0.729752
O  -1.409075 -1.124724 1.295514
O  0.409035 2.377018 -0.810065
O  4.700442 0.601548 -1.352864
N  1.159095 -1.439061 0.783689
N  2.489322 -1.615897 0.496532
N  2.617491 2.337853 -1.552784
N  5.037777 -1.448784 -0.323955
C  -1.740251 0.340522 -0.617516
C  -2.533388 -0.99258 -0.856751
C  -0.819527 0.064553 0.608357
C  -4.063043 0.682314 -0.051871
C  -2.03626 -1.961335 0.233747
C  0.632751 -0.258767 0.301734
C  -4.279574 0.507014 1.459333
C  -5.162154 1.479819 -0.748007
C  1.702083 0.40865 -0.346209
C  2.831531 -0.483788 -0.20611
C  1.535212 1.780317 -0.926651
C  4.247122 -0.38426 -0.675576
H  -1.166692 0.710848 -1.476402
H  -2.400572 -1.404224 -1.870543
H  -0.882731 0.920011 1.300304
H  -2.863413 -2.517205 0.700597
H  -1.289186 -2.669761 -0.181832
H  -4.322828 1.497878 1.944145
H  -5.232992 -0.018705 1.643094
H  -3.456534 -0.072519 1.91054
H  -4.938154 1.561764 -1.823238
H  -6.135978 0.977671 -0.617943
H  -5.223026 2.493123 -0.316425
H  0.641738 -2.106603 1.357888
H  3.524939 1.829412 -1.60975
H  2.504016 3.279437 -1.928074
H  4.636153 -2.216417 0.216984
H  6.015007 -1.454377 -0.610166
