program: Gaussian 09
title: 000282122
version: EM64L-G09RevD.01
frameworkgroup: C1[X(C13H17N3O6)]
method: RPBEPBE
basis: SDD
operation: Freq
keyword: #p
keyword: freq=noraman
keyword: PBEPBE/SDD
title: #p freq=noraman PBEPBE/SDD
converged: YES YES NO NO
title: Mulliken charges:
elementType: O O O O O O N N N C C C C C C C C C C C C C H H H H H H H H H H H H H H H H H
charge: -0.275103 -0.274003 -0.283435 -0.272966 -0.201184 -0.263759 -0.428653 -0.062970 -0.625199 -0.197144 -0.123563 -0.175141 0.342188 -0.352635 0.352662 -0.688817 -0.694518 0.001416 -0.068346 0.133729 0.178499 -0.501967 0.303857 0.250577 0.285183 0.257745 0.214672 0.218794 0.271338 0.220436 0.220329 0.220937 0.240914 0.358822 0.349206 0.334537 0.229686 0.260780 0.243095
chargesum: 0.00000
title: Mulliken charges with hydrogens summed into heavy atoms:
elementType: O O O O O O N N N C C C C C C C C C C C C C
charge: -0.275103 -0.274003 -0.283435 -0.272966 -0.201184 -0.263759 -0.069831 -0.062970 0.058545 0.106712 0.127015 0.110043 0.342188 0.119781 0.352662 0.021752 -0.012339 0.001416 -0.068346 0.133729 0.178499 0.231595
polarizability: 2.22785077e+02 -7.79369917e+00 1.81456076e+02 -6.38734371e+00 1.35617942e+00 1.24986403e+02
1716.lowfreq: -10.5500 -0.0005 -0.0003 0.0004 3.4143 6.0358 14.5237 28.4434 36.1420
frequency: 13.6615 28.0526 35.7352 56.3203 66.7477 75.1888 92.2469 105.0468 115.7088 124.6285 139.9069 159.2100 167.6689 196.9013 227.1474 243.3843 266.5337 272.9979 281.6483 310.6878 324.2520 341.4057 375.4156 384.0021 406.9163 443.0089 483.9447 493.8009 532.3849 549.5921 582.3169 597.5087 621.7512 632.9082 642.5210 674.4684 690.4211 714.7116 726.4524 742.5980 745.6233 755.1596 783.7539 806.4588 828.9331 848.8594 859.3756 883.1449 900.5813 925.3013 938.8963 960.3875 986.4904 999.0019 1004.6546 1021.4628 1047.2784 1056.9608 1068.7510 1075.9617 1112.8470 1129.8263 1140.1278 1149.8959 1186.3175 1192.2137 1204.0868 1214.7748 1232.8038 1259.9428 1266.1151 1268.0974 1280.6223 1307.3758 1314.3074 1333.7552 1343.4555 1365.5182 1381.2605 1395.0327 1417.7146 1433.3093 1451.5778 1451.9525 1453.3126 1457.6769 1462.4310 1471.7256 1484.2459 1485.0564 1545.9853 1581.7383 1631.1322 1652.7249 2971.6281 2992.5314 3007.3021 3007.7631 3041.0461 3061.7584 3084.1453 3094.8689 3101.1878 3109.5309 3112.5669 3113.9262 3121.1852 3151.8361 3512.2325 3583.8830 3674.9998
redmass: 5.7824 4.9476 4.4202 4.7922 5.9595 4.5906 3.4898 3.7257 1.2499 5.2454 6.4561 5.3956 1.0779 5.0809 3.3700 1.0750 4.5141 6.9317 4.0830 4.4349 4.7054 2.7719 2.9913 4.4687 2.9322 6.6611 4.0573 6.6303 5.9992 1.4780 4.7754 1.1869 4.7163 3.5959 4.9977 6.0826 6.1361 3.9901 8.7580 6.5204 1.1486 6.2152 8.7942 5.9214 3.9295 6.8088 3.6568 2.9947 8.9158 1.5560 3.1108 2.2453 1.3208 4.9644 6.2160 3.8688 2.8147 5.5767 2.0412 2.5667 1.2722 3.8978 1.8532 1.4503 1.2057 1.6741 2.7412 4.0715 1.4922 3.3217 2.2279 1.4799 1.3473 4.2131 1.2375 1.2829 1.3898 2.5739 1.2748 1.2271 1.3025 3.5354 1.0647 1.0498 1.0782 1.0498 1.0517 1.0642 1.6473 1.9879 6.9789 1.5337 3.8127 11.0913 1.0678 1.0350 1.0356 1.0291 1.0854 1.0880 1.0895 1.0998 1.1011 1.0996 1.0974 1.1049 1.1009 1.1053 1.0450 1.0821 1.1047
irintensity: 4.0270 0.1447 0.5521 0.2988 8.5976 1.1376 4.1143 2.6030 0.3386 3.4659 7.0207 1.4772 0.4960 9.3203 9.4023 1.2344 1.7671 2.8671 12.5928 0.6100 11.8797 1.0803 0.5200 6.0193 5.5795 15.4804 13.4940 19.9098 4.0296 111.9155 4.3723 134.5813 2.8479 2.7457 6.0760 7.5082 16.5622 14.6965 9.7181 33.9304 94.2811 15.1855 2.0332 44.5613 46.1723 5.6253 10.9575 6.2069 11.6004 2.3303 28.7190 9.9404 0.5804 31.9670 147.6648 90.5619 47.1599 137.4387 6.1379 35.5096 0.9128 4.8914 30.4434 20.8814 3.7143 68.1117 55.1378 89.0388 16.8204 87.2582 20.8227 11.1493 21.3062 138.5560 0.9380 6.7006 9.1679 3.9119 41.4400 35.3779 9.1381 133.0884 6.5600 15.5352 3.4709 6.6885 9.8357 0.2474 22.8517 10.6590 36.8649 151.2168 277.6919 186.3177 47.9526 16.4876 12.6955 30.6851 3.8051 23.3865 6.4951 7.4550 6.2126 22.0738 15.0303 18.7576 19.6185 13.9896 48.8021 109.2041 52.7562
temp: 298.150 k
press: 1.00000 atm
elementType: 8 8 8 8 8 8 7 7 7 6 6 6 6 6 6 6 6 6 6 6 6 6 1 1 1 1 1 1 1 1 1 1 1 1 1 1 1 1 1
symmnumber: 1
zpe: 790960.0 jmol-1
zpe.correction: 0.301261 hartree
zpe.thermalcorrener: 0.322850 hartree
zpe.thermalcorrenthalpy: 0.323794 hartree
zpe.thermalcorrgfe: 0.248614 hartree
zpe.sumelectzpe: -1119.502820 hartree
zpe.sumelectthermal: -1119.481231 hartree
zpe.sumelectthermalent: -1119.480287 hartree
zpe.sumelectthermalfe: -1119.555467 hartree
dipole: -2.4198 -3.1020 -1.9436
dipole: 4.3882
quadrupole: -125.3176 -117.7658 -131.1195
quadrupole: -14.2730 -6.2534 -3.6127
quadrupole: -0.5833 6.9685 -6.3852 -14.2730 -6.2534 -3.6127
hfenergy: -1119.8040813 hartree
pointgroup: C01 [X(C13H17N3O6)]
dipole: -0.9786991 -1.3963556 -0.2700598 debye
polarizability: 222.1570193|-10.6529276|176.0944246|-7.1053809|-16.4648879|130.9761115 unknown
InChI: InChI=1S/C13H17N3O6/c1-13(2)21-5-4-20-10(9(5)22-13)7-6(12(18)19-3)8(11(14)17)16-15-7/h5,9-10,15H,4,14H2,1-3H3
charge 0 multiplicity 1
39 atoms
O  -2.71048 1.216631 0.153176
O  -3.919605 -0.549579 -0.830076
O  -1.589787 -1.759052 1.065615
O  1.053144 1.830733 -1.464447
O  1.907854 2.541592 0.585614
O  4.373681 0.820384 -0.796078
N  1.112092 -1.876697 0.911255
N  2.465867 -1.924607 0.664029
N  5.089115 -1.257585 0.006792
C  -1.699572 0.258998 -0.302447
C  -2.500793 -0.893822 -1.006202
C  -0.939829 -0.433771 0.869933
C  -4.043139 0.548304 0.170797
C  -2.077338 -2.181197 -0.275997
C  0.53605 -0.652614 0.612309
C  -4.35835 -0.017556 1.563095
C  -5.074436 1.548009 -0.343832
C  1.586808 0.162204 0.154445
C  2.755476 -0.666531 0.200776
C  1.557226 1.617299 -0.177084
C  4.132519 -0.293888 -0.237871
C  1.088735 3.243783 -1.925167
H  -1.017324 0.801724 -0.973692
H  -2.319188 -0.953558 -2.091659
H  -1.098342 0.136287 1.802248
H  -2.919086 -2.870826 -0.114814
H  -1.262474 -2.690981 -0.830529
H  -5.346428 -0.509782 1.549531
H  -3.59935 -0.757249 1.8684
H  -4.382545 0.802275 2.302035
H  -6.063451 1.065181 -0.419115
H  -5.149164 2.404671 0.347228
H  -4.775632 1.913071 -1.33912
H  0.609886 -2.683243 1.28378
H  4.824587 -2.139482 0.446868
H  6.051848 -1.081801 -0.274275
H  0.694581 3.213918 -2.950413
H  2.128758 3.608178 -1.906151
H  0.46388 3.875873 -1.272257
