program: Gaussian 09
title: 000282129
version: EM64L-G09RevD.01
frameworkgroup: C1[X(C15H17NO7)]
method: RPBEPBE
basis: SDD
operation: Freq
keyword: #p
keyword: freq=noraman
keyword: PBEPBE/SDD
title: #p freq=noraman PBEPBE/SDD
converged: YES YES NO NO
title: Mulliken charges:
elementType: O O O O O O O N C C C C C C C C C C C C C C C H H H H H H H H H H H H H H H H H
charge: -0.293343 -0.272437 -0.272755 -0.296381 -0.236736 -0.199246 -0.201307 0.027791 -0.146355 -0.131306 -0.025070 0.340655 -0.335542 -0.334347 -0.688628 -0.688347 0.222592 0.230531 -0.318034 -0.311518 -0.351455 -0.344571 0.388464 0.249198 0.245331 0.232370 0.251657 0.204906 0.256092 0.273145 0.220816 0.239952 0.220795 0.220907 0.264679 0.217797 0.282760 0.275631 0.291990 0.289321
chargesum: 0.00000
title: Mulliken charges with hydrogens summed into heavy atoms:
elementType: O O O O O O O N C C C C C C C C C C C C C C C
charge: -0.293343 -0.272437 -0.272755 -0.296381 -0.236736 -0.199246 -0.201307 0.027791 0.102843 0.114025 0.207299 0.340655 0.121021 0.194889 -0.007066 0.015036 0.222592 0.230531 -0.035274 -0.035887 -0.059465 -0.055250 0.388464
polarizability: 2.71197378e+02 1.30322550e+01 1.88080648e+02 -1.86252212e+01 1.12212143e+01 1.32398850e+02
1716.lowfreq: -14.6034 -6.8648 -5.6729 -0.0010 -0.0008 -0.0006 5.7470 8.1396 31.2669
frequency: -3.8881 5.2699 31.1419 40.4675 57.0070 63.4341 79.9547 105.0855 131.1066 137.4300 165.2874 193.0362 195.1327 207.6120 246.4753 251.4742 264.6946 282.9822 288.1230 331.1080 342.4168 377.7232 394.0511 409.7802 458.3225 475.5104 482.8115 484.9543 522.6036 527.1637 559.8762 608.7911 623.3512 652.3977 676.7702 684.7548 690.9515 720.3303 727.2208 764.1547 770.6029 794.7966 813.8433 837.8369 852.5649 862.7664 888.1930 890.6955 908.5775 923.8292 930.8737 941.2122 971.5728 985.9204 995.3920 1002.3655 1005.6887 1011.9886 1031.9618 1062.4207 1070.3840 1084.3693 1089.4317 1109.5241 1132.6502 1149.3689 1176.2872 1180.6968 1197.4269 1200.1343 1205.4881 1214.2341 1242.5421 1245.7332 1257.6912 1275.3906 1292.6944 1308.3989 1313.2449 1321.6587 1334.9035 1368.0933 1377.5730 1380.2336 1393.0690 1405.2060 1414.6217 1450.9067 1453.0700 1457.5224 1460.6836 1470.9405 1474.8232 1484.0456 1590.9128 1609.8152 1625.6474 2940.3968 2962.8478 2990.9766 3006.9900 3035.4684 3055.2587 3071.3975 3093.2200 3100.5429 3109.5133 3110.5633 3113.9048 3120.4262 3165.1881 3175.9960 3188.5680 3193.9066
redmass: 5.7308 5.3619 5.1960 8.5336 5.4952 6.5298 8.2374 3.6377 5.1170 7.5070 1.0947 4.6539 4.3779 3.6651 1.9561 1.7298 6.2984 5.3601 3.6022 2.6218 5.1783 2.8865 2.5878 2.8780 4.0783 4.1652 5.7097 8.5113 5.5114 4.5720 4.3168 4.0065 7.1344 6.1697 6.1771 4.0536 6.0061 6.0404 4.0195 5.0686 8.6624 4.4480 5.5959 4.6719 3.9470 1.2526 1.7009 3.3917 2.8217 1.6156 3.7627 2.4909 2.1636 1.3079 3.5533 1.3517 3.2605 1.3653 3.5264 2.7978 4.9751 3.0398 3.2390 1.3478 1.8148 2.0485 1.2310 1.4327 1.2945 1.2557 2.5493 6.6635 1.5228 3.1746 3.3024 1.2534 1.2610 1.1733 1.4506 1.2362 1.3309 7.8236 1.6565 1.3343 1.2201 8.1674 4.5375 1.0544 1.0731 1.0555 1.0795 1.0637 2.4164 1.0491 8.8292 6.3876 10.9888 1.0830 1.0687 1.0353 1.0355 1.0576 1.0870 1.0894 1.0998 1.1013 1.0994 1.0968 1.1072 1.1009 1.0902 1.0890 1.0958 1.0973
irintensity: 0.1684 0.1190 0.1746 0.0551 0.3170 0.6296 3.0136 4.0554 1.0164 3.3700 0.2742 15.5796 0.3478 2.6066 4.9411 5.4479 0.4524 3.5545 10.9261 1.7211 5.2632 0.3427 18.3065 0.0022 1.2841 7.2734 3.2331 13.4887 6.5127 1.9563 0.2050 1.2094 0.3828 0.0662 8.4472 47.8898 20.7831 6.0751 32.1489 3.9075 53.0593 16.3355 6.3810 28.4466 11.6485 1.2136 50.6558 9.6457 3.7467 2.1122 6.4511 55.9639 69.6720 0.4338 7.5180 0.5241 34.8029 0.0289 41.9643 60.8907 397.4936 5.4367 10.0143 11.3196 45.3339 4.6318 3.0171 25.3335 9.8399 4.0996 124.7667 453.0860 18.1622 173.2785 67.8952 7.5608 0.2419 0.4457 9.4327 7.5346 0.7970 83.5342 12.2332 34.2130 32.8041 9.9850 65.9013 6.5907 3.6635 9.6388 12.3061 0.3691 3.1926 15.2786 40.3417 3.4144 136.7516 43.0313 75.6488 13.7594 13.1723 7.8237 13.0168 54.9842 9.1239 6.3783 17.5834 20.3849 5.3823 18.9450 1.2965 1.2332 0.4290 0.8475
temp: 298.150 k
press: 1.00000 atm
elementType: 8 8 8 8 8 8 8 7 6 6 6 6 6 6 6 6 6 6 6 6 6 6 6 1 1 1 1 1 1 1 1 1 1 1 1 1 1 1 1 1
symmnumber: 1
zpe: 801488.7 jmol-1
zpe.correction: 0.305271 hartree
zpe.thermalcorrener: 0.325700 hartree
zpe.thermalcorrenthalpy: 0.326644 hartree
zpe.thermalcorrgfe: 0.253120 hartree
zpe.sumelectzpe: -1161.297519 hartree
zpe.sumelectthermal: -1161.277090 hartree
zpe.sumelectthermalent: -1161.276146 hartree
zpe.sumelectthermalfe: -1161.349670 hartree
dipole: 4.7768 -1.4238 -1.1597
dipole: 5.1176
quadrupole: -168.9810 -133.2820 -133.2647
quadrupole: -12.3983 3.5892 7.6703
quadrupole: -23.8051 11.8939 11.9112 -12.3983 3.5892 7.6703
hfenergy: -1161.6027901 hartree
pointgroup: C01 [X(C15H17N1O7)]
dipole: 1.8596118 0.0705454 -0.7686243 debye
polarizability: 273.6926239|14.1030275|131.0965657|1.8209705|12.4843912|186.8876867 unknown
InChI: InChI=1S/C15H17NO7/c1-15(2)22-12-8-20-11(13(12)23-15)7-21-14(17)9-3-5-10(6-4-9)16(18)19/h3-6,11-13H,7-8H2,1-2H3
charge 0 multiplicity 1
40 atoms
O  2.851792 -1.353171 0.224396
O  4.965055 -1.453137 -0.815175
O  3.623673 1.551541 -0.860753
O  0.115099 0.871124 0.004442
O  -0.449382 1.452307 2.189659
O  -7.104375 -0.307335 0.631862
O  -6.457851 -0.831255 -1.492019
N  -6.212163 -0.421139 -0.293205
C  2.689879 -0.666035 -1.061726
C  4.118695 -0.663085 -1.717424
C  2.326706 0.839479 -0.931563
C  4.304114 -1.554455 0.512536
C  4.500738 0.834487 -1.812447
C  1.52852 1.236979 0.303971
C  4.491161 -2.97942 1.026656
C  4.81984 -0.471479 1.470906
C  -0.783759 1.02672 1.058635
C  -2.175396 0.636218 0.670553
C  -3.189713 0.741406 1.657547
C  -2.494016 0.179396 -0.634674
C  -4.517626 0.395052 1.349933
C  -3.818734 -0.170062 -0.956371
C  -4.809312 -0.055192 0.04346
H  1.931138 -1.223122 -1.634575
H  4.1600 -1.166311 -2.697063
H  1.782626 1.156297 -1.849461
H  5.544028 1.020302 -1.516837
H  4.321034 1.215363 -2.840149
H  1.592117 2.324737 0.47927
H  1.864734 0.691534 1.20001
H  3.952432 -3.111109 1.980214
H  4.098474 -3.697511 0.28946
H  5.562533 -3.183603 1.193008
H  5.902612 -0.608168 1.637308
H  4.643418 0.535919 1.057709
H  4.302271 -0.554912 2.442818
H  -2.915096 1.096686 2.65547
H  -1.701476 0.103609 -1.382863
H  -5.320384 0.465776 2.087965
H  -4.098006 -0.524431 -1.951684
