program: Gaussian 09
title: 000282075
version: EM64L-G09RevD.01
frameworkgroup: C1[X(C10H10N4O4)]
method: RPBEPBE
basis: SDD
operation: Freq
keyword: #p
keyword: freq=noraman
keyword: PBEPBE/SDD
title: #p freq=noraman PBEPBE/SDD
converged: YES YES NO NO
title: Mulliken charges:
elementType: O O O O N N N N C C C C C C C C C C H H H H H H H H H H
charge: -0.187888 -0.270654 -0.211951 -0.206868 0.035961 -0.432934 0.023532 0.015844 -0.406885 -0.513880 -0.537840 0.045267 0.299324 0.264541 -0.296113 -0.498500 0.445894 -0.368801 0.236984 0.236875 0.253691 0.253771 0.259327 0.259298 0.372426 0.300990 0.335745 0.292845
chargesum: 0.00000
title: Mulliken charges with hydrogens summed into heavy atoms:
elementType: O O O O N N N N C C C C C C C C C C
charge: -0.187888 -0.270654 -0.211951 -0.206868 0.035961 -0.060508 0.023532 0.015844 0.066973 -0.006418 -0.019215 0.045267 0.299324 0.264541 0.004877 -0.162755 0.445894 -0.075955
polarizability: 3.30519152e+02 6.29124613e-01 1.84909857e+02 4.26711128e-02 2.58608866e-02 6.93958561e+01
1716.lowfreq: -7.4942 -2.3454 0.0008 0.0009 0.0009 4.1673 20.5445 51.1113 57.2865
frequency: 20.5407 51.1079 57.2862 59.0289 61.9976 81.2188 135.7325 150.4492 164.6625 201.4489 244.9069 271.7595 319.2473 334.4185 370.6675 391.7671 432.3933 455.4000 495.7711 513.5030 515.2132 594.5958 628.9380 652.3409 671.0065 705.9705 724.8742 730.8965 731.0876 742.9737 754.2561 820.0762 830.2891 862.8845 863.1110 887.5263 938.6782 958.2237 962.9767 994.6483 1011.0064 1030.6287 1054.1842 1065.8139 1101.2635 1137.7544 1162.1984 1166.9486 1181.1045 1186.8842 1205.4374 1213.0074 1233.5389 1239.1881 1258.4080 1301.8241 1340.3343 1359.4316 1387.0903 1423.7552 1434.6766 1447.9569 1468.1038 1476.7945 1517.0137 1578.9771 1623.6003 1647.4324 2996.0965 3013.4948 3050.0310 3056.7763 3075.3242 3124.9009 3179.7666 3189.2737 3200.0526 3242.6765
redmass: 2.6813 4.1176 3.7714 5.3979 7.2195 5.8942 5.2948 9.7217 5.4157 6.9624 6.3986 4.1912 8.7585 4.5881 12.6378 9.0415 3.4492 3.9171 8.2519 5.8100 3.6674 5.3691 8.0717 7.8934 9.9513 7.5034 4.9032 1.5823 3.3056 1.1001 12.5039 1.1765 5.1341 1.4151 3.3233 7.3616 3.1345 3.7491 1.4067 1.0498 1.3141 4.7059 2.2280 2.0872 4.0975 1.3706 3.2177 8.9429 1.1542 1.1796 1.4293 5.0087 1.8900 1.5485 1.6963 2.0803 4.6755 7.2131 4.8345 1.0824 1.0945 5.5125 1.1217 2.7212 4.0489 5.0009 7.4032 11.5773 1.0590 1.0598 1.0616 1.1045 1.1045 1.1080 1.0894 1.0919 1.0963 1.0793
irintensity: 0.0557 0.0521 0.9947 0.2453 0.1575 2.5835 3.0565 1.2598 3.5228 6.4054 3.1567 0.8047 0.6027 1.2247 0.0387 0.0691 0.0528 2.0191 13.4698 9.3098 12.2118 5.5849 11.6855 16.1491 13.6035 8.3545 0.9758 2.8379 8.0676 14.1935 8.1061 103.4338 15.2986 20.8878 3.3866 6.1893 3.5442 2.2389 24.6256 0.2554 0.0538 24.9841 49.8040 0.0775 56.4399 46.8040 24.9903 375.5375 0.0465 0.0753 12.0653 389.0063 142.6826 12.8498 5.1212 87.5034 212.8477 77.4816 26.0243 25.7838 2.4281 0.9137 4.0249 34.5339 116.5991 106.5558 351.8911 166.2769 7.8632 11.2492 53.8361 7.3312 4.2096 30.0147 2.8415 19.7799 0.1532 64.8801
temp: 298.150 k
press: 1.00000 atm
elementType: 8 8 8 8 7 7 7 7 6 6 6 6 6 6 6 6 6 6 1 1 1 1 1 1 1 1 1 1
symmnumber: 1
zpe: 524961.0 jmol-1
zpe.correction: 0.199947 hartree
zpe.thermalcorrener: 0.215857 hartree
zpe.thermalcorrenthalpy: 0.216801 hartree
zpe.thermalcorrgfe: 0.154072 hartree
zpe.sumelectzpe: -905.450574 hartree
zpe.sumelectthermal: -905.434665 hartree
zpe.sumelectthermalent: -905.433720 hartree
zpe.sumelectthermalfe: -905.496449 hartree
dipole: -9.0931 -2.4708 0.0028
dipole: 9.4228
quadrupole: -111.4105 -116.7090 -101.5660
quadrupole: 5.1780 -0.0214 0.0051
quadrupole: -1.5154 -6.8138 8.3292 5.1780 -0.0214 0.0051
hfenergy: -905.6505213 hartree
pointgroup: C01 [X(C10H10N4O4)]
dipole: 3.5746843 -0.9819634 0.0268306 debye
polarizability: 330.499977|-1.0293323|184.9139481|1.9523468|-0.2477886|69.4109406 unknown
InChI: InChI=1S/C10H10N4O4/c15-13(16)8-4-5-9(10(6-8)14(17)18)12-11-7-2-1-3-7/h4-6,12H,1-3H2
charge 0 multiplicity 1
28 atoms
O  -1.311163 3.293855 -0.018253
O  0.86012 2.607993 0.001685
O  -4.588732 -2.061481 -0.032296
O  -4.977905 0.190843 -0.040354
N  2.303969 -1.02641 0.018581
N  1.428101 0.066718 0.00924
N  -0.431937 2.354117 -0.008762
N  -4.186133 -0.83096 -0.031817
C  5.69878 -0.362003 0.036787
C  4.785914 -1.649078 0.037024
C  4.418029 0.557203 0.027725
C  3.574678 -0.726633 0.026361
C  0.07037 -0.140702 -0.000269
C  -0.868671 0.959653 -0.00978
C  -0.465834 -1.472126 -0.00139
C  -2.261998 0.728823 -0.020191
C  -2.733352 -0.588204 -0.021022
C  -1.838431 -1.696884 -0.011564
H  6.324431 -0.251323 0.935305
H  6.332036 -0.257623 -0.857169
H  4.867794 -2.287194 0.934331
H  4.877942 -2.295447 -0.853323
H  4.299393 1.194052 -0.868581
H  4.289926 1.197853 0.920029
H  1.737467 1.059714 0.008215
H  0.24745 -2.298104 0.005895
H  -2.955413 1.573531 -0.027298
H  -2.25053 -2.709281 -0.012509
