program: Gaussian 09
title: 000282081
version: EM64L-G09RevD.01
frameworkgroup: C1[X(C12H18N2O3S)]
method: RPBEPBE
basis: SDD
operation: Freq
keyword: #p
keyword: freq=noraman
keyword: PBEPBE/SDD
title: #p freq=noraman PBEPBE/SDD
converged: YES YES NO NO
title: Mulliken charges:
elementType: S O O O N N C C C C C C C C C C C C H H H H H H H H H H H H H H H H H H
charge: 0.929631 -0.267387 -0.535855 -0.527529 -0.391888 -0.306308 0.175978 -0.695476 -0.741716 -0.689145 0.245340 -0.129247 -0.245292 -0.211044 0.450859 -0.402608 -0.341348 -0.801714 0.248145 0.230271 0.211465 0.220456 0.236116 0.215048 0.215544 0.217027 0.250676 0.364533 0.308437 0.291932 0.279958 0.245558 0.244743 0.233174 0.227398 0.244269
chargesum: 0.00000
title: Mulliken charges with hydrogens summed into heavy atoms:
elementType: S O O O N N C C C C C C C C C C C C
charge: 0.929631 -0.267387 -0.535855 -0.527529 -0.027355 0.002128 0.175978 -0.005595 -0.070096 -0.005899 0.245340 -0.129247 0.046640 0.068913 0.450859 -0.157051 -0.096604 -0.096872
polarizability: 1.91856571e+02 -5.60620688e-01 2.08557491e+02 7.16701608e-01 -1.42540216e+00 1.64143017e+02
1716.lowfreq: -18.5680 -14.4152 -11.6308 -0.0013 0.0011 0.0012 10.4594 12.2244 17.4314
frequency: -15.2369 -8.9458 16.5997 37.6814 51.7104 57.8324 78.4753 115.8034 120.9965 155.1276 159.0088 200.3357 215.9480 232.0905 248.1360 264.3587 278.9238 288.2716 301.2986 302.7089 345.2500 348.7829 351.8897 370.7534 378.9906 404.2153 411.6511 472.5030 501.5282 509.4535 571.7728 582.2203 620.3421 671.1469 706.9992 718.3142 775.4016 792.2350 806.9078 821.2941 846.5839 863.3524 924.3231 926.1080 937.5619 952.4462 959.7521 978.6731 983.6301 989.6476 994.3047 1018.8642 1021.1969 1045.5435 1048.9775 1078.8342 1117.0650 1144.0120 1183.8801 1199.4054 1217.2114 1232.1510 1258.6966 1294.5437 1340.0961 1373.6442 1376.1976 1379.9974 1388.9821 1399.1615 1402.8918 1455.3122 1456.0872 1469.0066 1469.6172 1471.1815 1473.6140 1475.9152 1480.3989 1495.5489 1503.7645 1590.3907 1591.4798 1594.0286 2966.6613 2981.6736 2982.2321 2984.7688 3058.3874 3062.1290 3074.9961 3077.3767 3082.4574 3091.3103 3097.5697 3102.2749 3134.0891 3136.0202 3158.2021 3165.2823 3211.4189 3569.5674
redmass: 2.9163 1.1088 3.4718 4.5900 5.3493 4.5470 6.8929 5.9066 5.1649 7.6187 7.7587 1.2162 3.8238 3.3407 1.8667 1.4758 4.3362 4.4135 1.1527 2.5308 2.9072 3.0608 3.3563 3.3081 6.4896 3.1878 4.2955 3.8371 4.6933 3.6948 3.1271 5.7500 6.9522 1.2996 3.2923 5.5596 4.8674 3.2061 11.8523 1.3850 1.2455 2.5948 1.7491 4.6472 1.6132 1.2465 1.3107 1.4789 1.6265 2.6026 2.4601 1.4516 1.3865 2.4205 1.5894 3.0181 1.2956 2.9907 1.1437 2.9299 3.0420 3.1602 2.5540 1.2665 1.4517 1.1829 1.1910 5.0336 3.0445 1.2680 1.2251 1.2071 1.0543 1.0713 2.1535 1.0726 1.0969 1.1021 1.1269 1.0462 1.0688 6.7596 5.4981 5.6509 1.0369 1.0378 1.0348 1.0356 1.1007 1.0966 1.0981 1.1007 1.0991 1.0994 1.1006 1.0998 1.0889 1.0895 1.0957 1.0962 1.0722 1.0786
irintensity: 0.2662 0.3780 1.3220 0.3064 1.0634 1.0210 2.2932 0.6189 1.6562 1.9298 23.1917 0.7382 5.4214 6.5531 1.5124 0.9449 1.8226 3.4913 0.3438 3.2079 4.6337 9.4606 16.2399 1.9636 15.4797 2.4200 9.7600 14.7927 9.9395 77.0966 0.6248 36.5516 0.3360 34.6990 0.6909 0.5129 1.8012 9.3021 131.8963 18.9078 3.6198 19.5025 3.6056 78.9389 5.9338 0.8060 0.5267 1.8258 16.2597 36.7555 16.0689 1.8108 1.1437 22.0190 20.2967 2.2611 8.4867 274.7953 6.1596 2.1884 5.4304 8.4881 12.4352 3.0396 179.4382 19.9939 23.9290 3.6714 11.2473 17.0700 19.2582 66.6157 5.5498 10.7959 18.8785 3.4227 13.7376 47.2197 23.7774 12.4392 18.9936 3.8572 43.4830 34.0211 21.3265 19.0562 28.1994 23.4336 21.9247 14.7497 5.8613 20.9783 65.7026 15.4804 2.0308 28.2988 12.5163 6.4866 6.0248 5.4198 40.4787 45.1214
temp: 298.150 k
press: 1.00000 atm
elementType: 16 8 8 8 7 7 6 6 6 6 6 6 6 6 6 6 6 6 1 1 1 1 1 1 1 1 1 1 1 1 1 1 1 1 1 1
symmnumber: 1
zpe: 745437.7 jmol-1
zpe.correction: 0.283922 hartree
zpe.thermalcorrener: 0.303018 hartree
zpe.thermalcorrenthalpy: 0.303962 hartree
zpe.thermalcorrgfe: 0.235760 hartree
zpe.sumelectzpe: -1199.757427 hartree
zpe.sumelectthermal: -1199.738331 hartree
zpe.sumelectthermalent: -1199.737387 hartree
zpe.sumelectthermalfe: -1199.805589 hartree
dipole: -3.9448 7.8226 1.7768
dipole: 8.9394
quadrupole: -112.2980 -124.8974 -116.8531
quadrupole: 16.2465 -6.3876 1.6155
quadrupole: 5.7182 -6.8813 1.1631 16.2465 -6.3876 1.6155
hfenergy: -1200.0413491 hartree
pointgroup: C01 [X(C12H18N2O3S1)]
dipole: -1.1436893 3.2122772 0.8618255 debye
polarizability: 191.1171783|1.7653743|208.046458|5.4141499|3.5260332|165.3934426 unknown
InChI: InChI=1S/C7H7O2S.C5H11N2O/c1-6-2-4-7(5-3-6)10(8)9;1-5(2,3)4(8)7-6/h2-5H,1H3;6-7H,1-3H3
charge 0 multiplicity 1
36 atoms
S  0.846285 -2.543191 -0.006183
O  -1.357989 -0.046592 -1.967081
O  0.789409 -3.20273 1.482543
O  1.701341 -3.207135 -1.227927
N  -1.844059 -1.394827 -0.161291
N  -1.172271 -2.498561 -0.669489
C  -2.735491 0.974847 -0.17948
C  -1.78294 2.201046 -0.061176
C  -3.291909 0.605887 1.219454
C  -3.908833 1.320699 -1.143361
C  -1.923407 -0.157925 -0.839149
C  1.416439 -0.75053 0.241791
C  1.402757 -0.230035 1.545747
C  1.877476 -0.028632 -0.872247
C  2.35046 1.8620 0.642381
C  1.874814 1.089491 1.734038
C  2.345985 1.284259 -0.657091
C  2.879145 3.268404 0.854408
H  -1.366518 2.459335 -1.049351
H  -0.941195 1.993022 0.624587
H  -2.344434 3.069982 0.327903
H  -2.485906 0.366237 1.939466
H  -3.842044 1.47159 1.628859
H  -4.009369 -0.236557 1.178153
H  -4.462742 2.194804 -0.755431
H  -4.61646 0.476538 -1.236707
H  -3.522081 1.562646 -2.147625
H  -2.291789 -1.544245 0.743799
H  -0.974422 -2.272193 -1.67845
H  1.069375 -0.851932 2.383236
H  1.8799 -0.477355 -1.870336
H  1.882142 1.517876 2.742862
H  2.713069 1.867487 -1.509498
H  2.469641 3.970483 0.105815
H  2.627485 3.652128 1.857525
H  3.981036 3.293882 0.754206
