program: Gaussian 09
title: 000282030
version: EM64L-G09RevD.01
frameworkgroup: C1[X(C5H7N3OS2)]
method: RPBEPBE
basis: SDD
operation: Freq
keyword: #p
keyword: freq=noraman
keyword: PBEPBE/SDD
title: #p freq=noraman PBEPBE/SDD
converged: YES YES NO YES
title: Mulliken charges:
elementType: S S O N N N C C C C C H H H H H H H
charge: 0.292850 0.268673 -0.345628 0.022614 -0.596243 -0.622912 0.148158 -0.216320 -0.508262 0.200296 -0.822694 0.385654 0.314805 0.280194 0.248398 0.280201 0.339573 0.330644
chargesum: 0.00000
title: Mulliken charges with hydrogens summed into heavy atoms:
elementType: S S O N N N C C C C C
charge: 0.292850 0.268673 -0.345628 0.022614 0.104216 0.047305 0.148158 -0.216320 -0.508262 0.200296 -0.013901
polarizability: 1.65000917e+02 -8.84246400e+00 1.37091943e+02 6.35012768e-04 1.90472733e-03 4.68246927e+01
1716.lowfreq: -6.6104 -0.0022 -0.0021 -0.0007 5.4266 9.0759 41.5651 94.9275 117.0460
frequency: 41.5409 94.9254 117.0429 126.7656 142.4584 148.4980 205.6876 255.2950 309.9985 328.5838 348.5475 368.8472 384.6706 479.6167 514.6950 524.8294 579.5638 601.0573 602.7951 612.5034 654.7016 692.8199 733.6417 782.7613 825.3254 918.0949 982.0840 999.4552 1050.1472 1136.8041 1241.8062 1313.1616 1342.1197 1434.6623 1435.1080 1453.7725 1470.1725 1508.8388 1569.5719 1597.5158 1614.7902 3024.1855 3152.7011 3154.1486 3266.3629 3523.4683 3652.9004 3686.8123
redmass: 3.6523 5.3421 4.0825 2.3050 2.6655 2.8029 3.9431 5.2891 5.2964 4.5321 1.3119 9.9657 8.2395 6.8424 1.6210 3.4831 6.2385 1.3888 6.0305 2.4036 7.4583 6.9821 2.9282 1.5454 4.5729 7.1913 1.1720 1.2862 1.9365 1.8842 7.9553 3.9003 1.1413 3.4899 1.0530 1.1160 3.1986 4.2843 1.6832 2.9024 1.9945 1.0275 1.1046 1.1063 1.0620 1.0443 1.0889 1.1049
irintensity: 2.6261 2.7783 1.6729 11.5470 0.8285 4.3433 15.8889 13.1464 8.4816 3.7150 116.9721 0.3311 0.5431 12.4302 175.4581 1.4709 11.0626 128.5131 18.5191 16.8046 2.8345 3.7391 15.0948 155.7312 33.1885 95.2265 8.1377 14.1520 6.6397 33.3025 0.7133 22.5196 6.8623 137.2838 15.4683 20.0259 44.2835 280.5359 140.8781 587.8619 76.8661 18.8025 5.6560 11.1450 192.8656 45.3372 96.6564 55.3252
temp: 298.150 k
press: 1.00000 atm
elementType: 16 16 8 7 7 7 6 6 6 6 6 1 1 1 1 1 1 1
symmnumber: 1
zpe: 329008.1 jmol-1
zpe.correction: 0.125313 hartree
zpe.thermalcorrener: 0.137341 hartree
zpe.thermalcorrenthalpy: 0.138285 hartree
zpe.thermalcorrgfe: 0.086627 hartree
zpe.sumelectzpe: -1229.528501 hartree
zpe.sumelectthermal: -1229.516472 hartree
zpe.sumelectthermalent: -1229.515528 hartree
zpe.sumelectthermalfe: -1229.567186 hartree
dipole: -1.5113 0.9105 0.0026
dipole: 1.7644
quadrupole: -82.1356 -60.9080 -83.0516
quadrupole: -10.4549 0.0092 0.0014
quadrupole: -6.7705 14.4571 -7.6865 -10.4549 0.0092 0.0014
hfenergy: -1229.6538131 hartree
pointgroup: C01 [X(C5H7N3O1S2)]
dipole: 0.596819 -0.3545376 0.0008797 debye
dipolederiv: -0.432245 0.1200193 0.0002902 0.0875993 -0.3165197 0.0002483 0.0003676 0.0000802 0.1091436 -0.5673693 0.1928917 0.0001959 0.1924693 -0.1227733 -0.0000342 0.0002187 -0.0000629 -0.0295653 -1.2496733 -0.0126134 0.000294 0.0365198 -0.6550252 0.0001838 0.0000252 0.0001282 -0.4044297 -0.2596027 -0.0595766 0.000106 -0.3405618 -0.7074982 0.0005159 0.0002687 0.0004607 -0.1143018 -1.161966 0.6788718 0.0000998 0.3783285 -0.74502 -0.0004626 0.0003047 -0.0007776 -0.614361 -0.3093353 0.0979118 -0.0000936 -0.0607611 -1.3508621 0.0004944 -0.000036 0.0002991 -0.6894978 -0.563278 -0.4186811 0.0004101 0.0639817 -0.806192 0.0001628 0.0001943 0.0005861 -0.0811429 1.0630956 -0.5409661 -0.0006803 -0.3593442 0.9268982 0.0000389 -0.0008023 0.0002045 0.0384566 0.9847514 -0.3087382 -0.0004413 -0.3697592 0.6906162 -0.000336 -0.0004837 -0.000289 -0.1495636 1.4726258 0.3415619 -0.0004853 0.3036106 1.7873177 -0.0010899 -0.0002717 -0.0011207 0.2639665 -0.0080043 -0.0608428 0.0000545 -0.1303046 0.1949523 -0.0000023 0.0001213 -0.0000381 0.0563823 0.3343475 0.0550739 0.0000019 0.0924322 0.3816209 0.0000158 -0.0000236 0.0001063 0.3721317 0.2341987 -0.0672707 0.0002007 -0.0821007 0.2171949 0.0001893 0.0001969 0.0002531 0.3911915 0.0994943 -0.0641468 0.0823974 0.0263546 -0.0261435 0.0595602 0.0530067 0.0427724 -0.018769 -0.0931511 0.0582101 0.0001007 0.0647918 0.0611767 0. 0.0000957 0.0000049 0.1321898 0.0993388 -0.0642745 -0.0824648 0.0262403 -0.0262329 -0.0595777 -0.0531659 -0.0426861 -0.018507 0.1904084 0.0315254 -0.0000178 0.0642096 0.2728323 0.0000055 -0.0000426 0.0000045 0.3713717 0.1663645 0.0210441 0.0000317 0.0062941 0.2236578 0.0000875 0.0000262 0.0000745 0.3853045 unknown
polarizability: 165.1093732|-8.6689119|136.9834372|-0.0589444|-0.0377138|46.8247418 unknown
InChI: InChI=1S/C5H7N3OS2/c1-10-5-8-2(3(6)9)4(7)11-5/h6-7H2,1H3
charge 0 multiplicity 1
18 atoms
S  0.77863 2.15555 -0.001195
S  3.344896 0.34021 -0.001514
O  -3.016252 -0.57295 0.001561
N  0.679124 -0.528385 0.000387
N  -2.034905 1.961869 0.001145
N  -1.491395 -2.346628 0.002439
C  -0.658358 -0.082574 0.000889
C  -0.834117 1.314766 0.000398
C  1.54502 0.452288 -0.000601
C  -1.800274 -1.002636 0.001822
C  3.507925 -1.536913 -0.000698
H  -2.850726 1.320462 0.002417
H  -2.124811 2.973472 0.000513
H  3.032427 -1.944555 0.902334
H  4.590341 -1.735919 -0.001229
H  3.03138 -1.945429 -0.902784
H  -0.514075 -2.636656 0.002476
H  -2.246032 -3.029173 0.002941
