program: Gaussian 09
title: 000282046
version: EM64L-G09RevD.01
frameworkgroup: C1[X(C17H21Cl2NO3)]
method: RPBEPBE
basis: SDD
operation: Freq
keyword: #p
keyword: freq=noraman
keyword: PBEPBE/SDD
title: #p freq=noraman PBEPBE/SDD
converged: YES YES NO NO
title: Mulliken charges:
elementType: Cl Cl O O O N C C C C C C C C C C C C C C C C C H H H H H H H H H H H H H H H H H H H H H
charge: -0.074936 -0.085318 -0.171517 -0.184308 -0.427673 -0.115120 -0.288453 -0.236166 -0.575750 -0.578718 -0.474991 0.159940 0.200257 0.586774 -0.338332 -0.334188 -0.440864 -0.357190 -0.577499 -0.581861 -0.343052 -0.411682 0.280434 0.260960 0.258498 0.274144 0.232964 0.232094 0.274783 0.251369 0.257389 0.231457 0.238352 0.228241 0.238062 0.239863 0.222039 0.269966 0.259072 0.310933 0.254484 0.256008 0.222532 0.357004
chargesum: 0.00000
title: Mulliken charges with hydrogens summed into heavy atoms:
elementType: Cl Cl O O O N C C C C C C C C C C C C C C C C C
charge: -0.074936 -0.085318 -0.171517 -0.184308 -0.070669 -0.115120 -0.029955 0.024793 -0.068642 -0.071842 0.033767 0.159940 0.200257 0.586774 0.131477 0.132114 -0.201002 -0.135151 -0.048461 -0.016444 -0.087043 -0.189150 0.280434
polarizability: 2.86490700e+02 1.67390759e+01 2.14115058e+02 -1.21036789e+01 -7.27276775e+00 1.67332389e+02
1716.lowfreq: -12.6716 -7.0537 -3.9609 -0.0009 0.0009 0.0015 7.2901 17.8188 19.7085
frequency: -1.8687 17.6322 19.6030 28.5226 35.5810 41.3088 60.2905 80.5690 85.9453 94.4885 113.6101 122.4962 129.3782 172.1113 183.3491 192.9404 204.0470 224.7955 250.0669 287.7471 310.1696 351.1164 361.5155 371.5053 377.9509 385.7624 410.7766 424.8521 443.8217 460.4339 485.4811 512.0581 519.4352 560.2790 596.2312 600.3427 629.6977 645.4189 661.8248 666.1051 730.5434 749.6384 773.3165 782.1754 797.2136 804.9218 819.3991 836.1422 845.2053 865.6259 884.2775 896.4894 927.4619 960.7444 967.8762 996.3853 999.3475 1002.6566 1010.2783 1038.6262 1048.0242 1058.7431 1062.1221 1080.6805 1097.8831 1100.3073 1118.8557 1141.8913 1144.4311 1161.4198 1180.4790 1180.8151 1200.5817 1210.0788 1225.6864 1233.1240 1246.1676 1251.6778 1259.6729 1262.7956 1265.0860 1278.3917 1292.4309 1306.2471 1306.8390 1309.7609 1317.1405 1343.9337 1361.9985 1369.4218 1386.0862 1396.5320 1430.0927 1441.8071 1446.5355 1452.5263 1459.2395 1468.8210 1478.3073 1479.8465 1504.0129 1596.1443 1617.1817 1626.6018 1651.4439 2934.8530 2950.9995 2954.3215 2959.8965 2980.5392 2983.0545 3001.1260 3041.1698 3046.7811 3057.5799 3065.3597 3066.0613 3087.1329 3090.5040 3107.8576 3128.3859 3132.1515 3143.9403 3156.6475 3173.3083 3582.8242
redmass: 6.0392 7.1506 8.5828 7.1342 6.6046 7.1696 6.1538 2.7769 5.1939 3.2523 3.6097 3.1005 5.3570 6.1881 5.5810 4.7128 5.4515 5.7562 4.5618 4.3941 2.9118 4.1776 1.1308 4.7879 3.5264 3.3483 2.9148 3.3873 3.4148 2.9650 3.0748 4.3379 2.8810 3.8984 4.4358 4.6474 5.8807 4.7869 6.2375 5.3826 3.7037 3.9674 1.1346 1.1576 3.1536 1.4978 4.9116 1.5119 3.3547 1.7011 2.8071 3.2238 1.3769 1.3787 2.5726 1.9012 1.5443 2.7426 1.7319 1.9474 2.7538 3.0605 3.3215 2.6268 1.8532 1.4757 1.7314 1.8094 1.3525 1.5984 1.4874 1.1846 1.8078 2.1506 1.5088 1.5569 1.2110 2.7790 1.3193 1.3002 1.3111 1.3022 1.7126 1.2770 1.5718 1.3468 1.1940 1.4140 1.3361 1.3421 1.3361 4.8949 2.6357 1.0926 1.0918 1.0915 1.0859 1.0835 1.0835 1.0845 2.7106 6.4066 9.0979 6.3837 10.1355 1.0680 1.0672 1.0673 1.0796 1.0697 1.0645 1.0792 1.0946 1.0950 1.0572 1.0578 1.0924 1.0967 1.0982 1.0866 1.0916 1.0950 1.1120 1.1118 1.0953 1.0661
irintensity: 1.4369 0.8726 0.1491 0.5612 0.3651 0.4666 0.1103 0.4403 6.9512 0.7576 1.9652 0.3770 2.9054 0.6133 0.8883 5.8269 5.1615 2.2305 10.6895 0.3471 2.2657 11.2981 143.2689 1.1052 2.2673 3.0161 0.4485 28.3161 5.9775 1.0265 21.0024 5.0641 22.8306 27.9847 10.1375 8.2326 6.9822 10.4130 93.6637 99.1831 0.2435 7.7043 6.5137 7.3926 4.1765 27.2467 7.3222 37.1581 6.3129 13.8231 7.2660 4.0356 0.1225 0.5569 31.9769 21.0511 3.7688 4.0110 1.9493 23.2221 0.7007 2.6160 6.5047 21.9379 38.8167 61.2529 2.3504 115.5521 262.9224 16.0365 2.9296 11.1055 38.6596 34.6664 25.1171 27.0147 28.1294 39.1795 13.0403 13.6140 9.9018 18.5894 38.9597 11.3392 21.5752 33.4824 7.4649 52.2152 0.9235 1.1341 6.3746 6.4822 15.1007 10.1386 10.4083 4.6208 9.1761 14.9034 9.4564 11.2769 101.9339 13.8414 225.8489 43.0627 161.3825 38.6478 10.3857 70.6779 7.0578 3.0892 3.6143 22.6588 6.0178 36.2833 17.5811 14.0796 6.5255 8.7704 8.9226 26.5057 19.9865 5.7654 21.5103 9.2177 5.1367 50.5424
temp: 298.150 k
press: 1.00000 atm
elementType: 17 17 8 8 8 7 6 6 6 6 6 6 6 6 6 6 6 6 6 6 6 6 6 1 1 1 1 1 1 1 1 1 1 1 1 1 1 1 1 1 1 1 1 1
symmnumber: 1
zpe: 916961.2 jmol-1
zpe.correction: 0.349252 hartree
zpe.thermalcorrener: 0.372151 hartree
zpe.thermalcorrenthalpy: 0.373095 hartree
zpe.thermalcorrgfe: 0.292908 hartree
zpe.sumelectzpe: -1859.197539 hartree
zpe.sumelectthermal: -1859.174640 hartree
zpe.sumelectthermalent: -1859.173696 hartree
zpe.sumelectthermalfe: -1859.253883 hartree
dipole: 5.1461 3.1277 -1.0265
dipole: 6.1089
quadrupole: -161.9054 -164.6033 -160.8308
quadrupole: 5.5582 -12.1052 -7.7765
quadrupole: 0.5411 -2.1568 1.6157 5.5582 -12.1052 -7.7765
hfenergy: -1859.5467914 hartree
pointgroup: C01 [X(C17H21Cl2N1O3)]
dipole: -2.0280779 1.281947 -0.1410643 debye
polarizability: 286.9033896|-19.2740856|212.5468824|-1.3157182|-11.3390104|168.487876 unknown
InChI: InChI=1S/C17H21Cl2NO3/c18-5-7-20(8-6-19)11-15-16(22)9-13(10-17(15)23)12-1-3-14(21)4-2-12/h1-4,13,15,21H,5-11H2
charge 0 multiplicity 1
44 atoms
Cl 4.346299 4.117367 -0.807543
Cl 5.995152 -1.962217 2.442837
O  0.55604 -1.443218 -2.852349
O  1.260497 -1.705137 1.327527
O  -7.135335 1.041988 0.812356
N  3.650276 0.05434 -0.326496
C  -1.761617 -0.794761 -0.236467
C  1.213895 -0.374959 -0.739659
C  -1.222179 -0.295202 -1.617055
C  -0.774903 -0.410918 0.915971
C  2.663961 -0.819675 -1.006035
C  0.209825 -0.763357 -1.854677
C  0.634132 -0.89562 0.599853
C  -3.173152 -0.279192 0.038153
C  3.934304 1.339225 -0.996547
C  4.817656 -0.635602 0.26743
C  -4.254125 -1.185979 0.187041
C  -3.444564 1.107353 0.154168
C  3.989508 2.462699 0.048775
C  4.505035 -1.036741 1.717002
C  -5.563886 -0.733709 0.44344
C  -4.748437 1.579311 0.410584
C  -5.810743 0.653138 0.555671
H  1.15994 0.733555 -0.668565
H  -1.804477 -1.901185 -0.278652
H  -1.864443 -0.659013 -2.435925
H  -1.245661 0.813589 -1.629996
H  -0.764563 0.692079 1.028484
H  -1.109304 -0.850834 1.869865
H  2.787845 -1.845552 -0.619041
H  2.831379 -0.863428 -2.103739
H  3.127449 1.562178 -1.718443
H  4.884329 1.321612 -1.575634
H  5.690673 0.042723 0.258807
H  5.106854 -1.537936 -0.312624
H  -4.069582 -2.263643 0.101842
H  -2.63504 1.840113 0.045304
H  4.805689 2.328433 0.774733
H  3.028584 2.587259 0.569116
H  3.64953 -1.722481 1.791332
H  4.353289 -0.158706 2.361898
H  -6.39819 -1.431475 0.558743
H  -4.936463 2.657423 0.496655
H  -7.213376 2.026256 0.874962
